ErrorVault.com

Runtime Errors




1. Table '|' is a linked table whose design can't be modified Error 10010 Table '|' is a linked table whose design can't be modified. If you want to add or remove fields or change their properties or data types, you must do so in the source [email protected] you want to open it [email protected]@[email protected]@@2.
2. Table '|' is in use Error 31528 Table '|' is in use. Please close the table and retry [email protected]@@[email protected]@@1.
3. Task - Sending ' reported error (0x8004210B): The operation timed out waiting for a response from the sending (SMTP) server Error 0x8004210B Task - Sending ' reported error (0x8004210B): The operation timed out waiting for a response from the sending (SMTP) server. If you continue to receive this message, contact your server administrator or Internet service provider (ISP). It usually occurs w
4. Task_2 Failed! Error=105 Error 105 "Task_2 Failed! Error=105. error codes are generated during the copying (""Task 1"") part of the process."
5. Teamviewer 7 Error Code 5 Error 5 Error 5: TeamViewer has encountered a problem and needs to close. We are sorry for the inconvenience.
6. Teamviewer 7 Error Code Waitforconnectfailed Error waitforconnectfailed Error waitforconnectfailed: TeamViewer has encountered a problem and needs to close. We are sorry for the inconvenience.
7. Teamviewer Error 10047 Error 10047 Error 10047: TeamViewer has encountered a problem and needs to close. We are sorry for the inconvenience.
8. TeamViewer Error 10054 Error 10054 Socket Error 10054 (Can't read from control socket).
9. TeamViewer Error 10060 Error 10060 Connection Timed Out (10060).
10. TeamViewer Error 10061 Error 10061 TCP Error Code 10061.
11. Teamviewer Error 1067 Error 1067 Error 1067: TeamViewer has encountered a problem and needs to close. We are sorry for the inconvenience.
12. Teamviewer Error 1072 Error 1072 Error 1072: TeamViewer has encountered a problem and needs to close. We are sorry for the inconvenience.
13. TeamViewer Error 11004 Error 11004 Modem Error 11004.
14. Teamviewer Error 12019 Error 12019 Error 12019: TeamViewer has encountered a problem and needs to close. We are sorry for the inconvenience.
15. Teamviewer Error 12029 Error 12029 Error 12029: TeamViewer has encountered a problem and needs to close. We are sorry for the inconvenience.
16. Teamviewer Error 12175 Error 12175 Error 12175: TeamViewer has encountered a problem and needs to close. We are sorry for the inconvenience.
17. Teamviewer Error 22 Error 22 Error 22: TeamViewer has encountered a problem and needs to close. We are sorry for the inconvenience.
18. TeamViewer Error 36 Error 36 Cannot Find TeamViewer.exe error.
19. TeamViewer Error 5 Error 5 Teamviewer Error: Connection could not be established.
20. Teamviewer Error 600 Error 600 Error 600: TeamViewer has encountered a problem and needs to close. We are sorry for the inconvenience.
21. Teamviewer Error 927 Error 927 Error 927: TeamViewer has encountered a problem and needs to close. We are sorry for the inconvenience.
22. TeamViewer Error 99 Error 99 Unable to connect.
23. Teamviewer Error 997 Error 997 Error 997: TeamViewer has encountered a problem and needs to close. We are sorry for the inconvenience.
24. Teamviewer Error Code 10035 Error 10035 Error 10035: TeamViewer has encountered a problem and needs to close. We are sorry for the inconvenience.
25. Teamviewer Error Code 1008 Error 1008 Error 1008: TeamViewer has encountered a problem and needs to close. We are sorry for the inconvenience.
26. Teamviewer Error Code 122 Error 122 Error 122: TeamViewer has encountered a problem and needs to close. We are sorry for the inconvenience.
27. Teamviewer Error Code 170 Error 170 Error 170: TeamViewer has encountered a problem and needs to close. We are sorry for the inconvenience.
28. Teamviewer Error Code 2 Error 2 Error 2: TeamViewer has encountered a problem and needs to close. We are sorry for the inconvenience.
29. Teamviewer Error Code 60 Error 60 Error 60: TeamViewer has encountered a problem and needs to close. We are sorry for the inconvenience.
30. Teamviewer Error Code 99 Error 99 Error 99: TeamViewer has encountered a problem and needs to close. We are sorry for the inconvenience.
31. Teamviewer Error Code=12002 Error Code=12002 Error Code=12002: TeamViewer has encountered a problem and needs to close. We are sorry for the inconvenience.
32. Teamviewer Error Code=36 Error Code=36 Error Code=36: TeamViewer has encountered a problem and needs to close. We are sorry for the inconvenience.
33. Template '|1' could not be instantiated Error 31629 Template '|1' could not be [email protected]|[email protected]@@@@3.
34. Temporarily unavailable Error 147 Error 147: Comodo Cloud Drive has encountered a problem and needs to close. We are sorry for the inconvenience.
35. TempVars can only store data Error 32538 TempVars can only store data. They cannot store objects.
36. That password isn't valid Error 2621 That password isn't [email protected] may have used a [email protected]@[email protected]@@1.
37. That webpage no longer exists (HTTP 410) Error 410 That webpage no longer exists (HTTP 410). Internet Explorer is able to connect to the website, but the webpage can't be found. Unlike HTTP error 404, this error is permanent and was turned on by the website administrator. It's sometimes used for limited-t
38. The 'Add from Outlook' command failed Error 32509 The 'Add from Outlook' command [email protected]@@[email protected]@@1.
39. The 'Save as Outlook Contact' command failed Error 32508 The 'Save as Outlook Contact' command [email protected]@@[email protected]@@1.
40. The '|' field can't be modified because it's a read-only field Error 9532 The '|' field can't be modified because it's a read-only [email protected]@@[email protected]@@1.
41. The '|' lookup column was changed to store multiple values Error 7920 The '|' lookup column was changed to store multiple values. You cannot reverse this [email protected]@@[email protected]@@1.
42. The '|' macro action cannot be run in disabled mode Error 2538 The '|' macro action cannot be run in disabled [email protected]@@[email protected]@@1.
43. The '|' module is open; Microsoft Office Access can't set the permissions on an open module Error 29032 The '|' module is open; Microsoft Office Access can't set the permissions on an open [email protected]@@[email protected]@@1.
44. The '|' RunCommand cannot be run in disabled mode Error 32001 The '|' RunCommand cannot be run in disabled [email protected]@@[email protected]@@1.
45. The '|' table was truncated; data was lost Error 9515 The '|' table was truncated; data was [email protected]@@[email protected]@@1.
46. The '|1' form does not exist Error 6033 The '|1' form does not [email protected] the name of an existing form in the List Items Edit Form property of the '|2' control or leave the property [email protected]@[email protected]@@1.
47. The Access project could not be opened Error 30022 The Access project could not be opened. You may not have adequate permissions, or the project may be read-only.
48. The acCmdExport command for RunCommand has been deprecated Error 32575 The acCmdExport command for RunCommand has been deprecated. Use the OutputTo action or one of the more specific RunCommands, such as acCmdExportExcel, acCmdExportRTF, and acCmdExportText.
49. The acCmdImport command for RunCommand has been deprecated Error 32576 The acCmdImport command for RunCommand has been deprecated. Use one of the more specific RunCommands, such as acCmdImportAttachAccess, acCmdImportAttachExcel, and acCmdImportAttachText.
50. The acCmdLinkTables command for RunCommand has been deprecated Error 32577 The acCmdLinkTables command for RunCommand has been deprecated. Use one of the more specific RunCommands, such as acCmdImportAttachAccess, acCmdImportAttachExcel, and acCmdImportAttachText.
51. The account name is invalid Error 2612 The account name is [email protected] information about naming conventions, click [email protected]@[email protected]@[email protected]
52. The action or method is invalid because the form or report isn't bound to a table or query Error 2491 The action or method is invalid because the form or report isn't bound to a table or [email protected] tried to use the ApplyFilter or SearchForRecord action or method. However, the form or report you applied the filter to is not based on a table or query, so th
53. The action or method requires a Control Name argument Error 2514 The action or method requires a Control Name [email protected] tried to use the GoToControl action or method, but you left the control name [email protected] the Control Name argument, enter a control or field name from the active form or [email protected]@[email protected]@1.
54. The action or method requires a data access page Name argument Error 2534 The action or method requires a data access page Name [email protected] tried to use the OpenDataAccessPage action or method, but you left the data access page Name argument [email protected] the data access page Name argument, enter the name of a data access page in
55. The action or method requires a File Name argument Error 2522 The action or method requires a File Name [email protected] tried to use the TransferSpreadsheet or TransferText action or [email protected] the File Name argument, enter a file [email protected]@[email protected]@1.
56. The action or method requires a Form Name argument Error 2494 The action or method requires a Form Name [email protected] tried to use the OpenForm action or method, but you left the Form Name argument [email protected] the Form Name argument, enter the name of a form in the current [email protected]@[email protected]@1.
57. The action or method requires a Macro Name argument Error 2502 The action or method requires a Macro Name [email protected]* You tried to use the RunMacro action or method, but you left the Macro Name argument blank.* Microsoft Office Access tried to create a custom menu bar for a form or report, but the Menu Macro Name arg
58. The action or method requires a Module or Procedure Name argument Error 2520 The action or method requires a Module or Procedure Name [email protected] tried to use the OpenModule action or method, but you didn't enter a name in either the Module Name or the Procedure Name argument in the Macro [email protected] a valid name in one of the
59. The action or method requires a Query Name argument Error 2496 The action or method requires a Query Name [email protected] tried to use the OpenQuery action or method, but you left the Query Name argument [email protected] the Query Name argument, enter a query [email protected]@@@1.
60. The action or method requires a Report Name argument Error 2497 The action or method requires a Report Name [email protected] tried to use the OpenReport action or method, but you left the Report Name argument [email protected] the Report Name argument, enter the name of a [email protected]@@@1.
61. The action or method requires a Specification Name argument Error 2511 The action or method requires a Specification Name [email protected] tried to use the TransferText action or method and you specified a Transfer Type argument but left the Specification Name argument [email protected] the Specification Name argument, enter an existin
62. The action or method requires a Table Name argument Error 2495 The action or method requires a Table Name [email protected] tried to use the OpenTable, TransferSpreadsheet, or TransferText action or method, but you left the Table Name argument [email protected] the Table Name argument, enter the name of a table that is in the cu
63. The action or method requires at least | argument(s) Error 2504 The action or method requires at least | argument(s)[email protected] tried to run a macro containing an action or used a method or action with the DoCmd object, but you didn't set the required number of arguments.For example, if you use the MoveSize action, you must
64. The activation code was not correctly inserted Error 551 The activation code was not correctly inserted. License installation fails.
65. The ActiveX control you tried to insert isn't registered Error 2794 The ActiveX control you tried to insert isn't [email protected] information on registering an ActiveX control, click [email protected]@[email protected]@[email protected]
66. The ActiveX Designer's Type Information does not match what was saved. Unable to Load Error 370 An ActiveX Designer could not recreate the information that it saved, and won't be loaded.
67. The application (C: \PROGRAM FILES\INTERNET EXPLORER\IEXPLORE.EXE) experienced a fatal application error Error C0000005 "The application (C: \PROGRAM FILES\INTERNET EXPLORER\IEXPLORE.EXE) experienced a fatal application error. Code: C0000005 (ACCESS_VIOLATION), Addr: 77E42DFC, Flags: 00000000. Attempts to run an IBM Rational Robot API recording result in ""fatal applicatio
68. The application failed to initialise properly (0xc015004) Error 0xC015004 The application failed to initialise properly (0xc015004). Operating system error code.
69. The application was unable to start correctly (0x000007b) Error 0x000007B The application was unable to start correctly (0x000007b). Click OK to close the application.
70. The application was unable to start correctly (0xc000007b). Error 0xC000007B Error occurs during BitDefender installation.
71. The ApplyFilter action contains a Filter Name that cannot be applied Error 2535 The ApplyFilter action contains a Filter Name that cannot be [email protected] filter name is not a valid argument in the ApplyFilter action in Client [email protected]@[email protected]@[email protected]
72. The ApplyFilter action or method can be carried out only from an Open macro or Open event procedure Error 2583 The ApplyFilter action or method can be carried out only from an Open macro or Open event [email protected]* You may have tried to run a macro or procedure containing the ApplyFilter action or method from a report property other than the OnOpen property.* You m
73. The ApplyFilter action requires a valid control name that corresponds to a subform or subreport Error 32003 The ApplyFilter action requires a valid control name that corresponds to a subform or [email protected]@@[email protected]@@1.
74. The ApplyFilter action requires that either the Filter Name or Where Condition argument is set Error 2533 The ApplyFilter action requires that either the Filter Name or Where Condition argument is [email protected] tried to run a macro containing an ApplyFilter action, but you didn't set the required [email protected]@[email protected]@[email protected]
75. The Automation object operation isn't available for the | object Error 2748 The Automation object operation isn't available for the | [email protected] the component's documentation for information on which operations are available for an Automation [email protected]@[email protected]@@1.
76. The Backup Exec Server Service did not start Error 4313 The Backup Exec Server Service did not start. An internal error (4313) occurred in object -1.
77. The bitmap you specified is not in a device-independent bitmap (.dib) format Error 2192 The bitmap you specified is not in a device-independent bitmap (.dib) [email protected] tried to set the PictureData property of a form, report, button, or image [email protected]@[email protected]@@1.
78. The bound or unbound object frame you tried to edit does not contain an OLE object Error 2771 The bound or unbound object frame you tried to edit does not contain an OLE [email protected] the frame, click Insert Object, and then use the dialog box to locate and either add or link to an object from a file that is not [email protected]@[email protected]@[email protected]
79. The cabinet file 'modules cab' required for this installation is corrupt and cannot be used Error 2350 The cabinet file 'modules cab' required for this installation is corrupt and cannot be used. You receive the message 'Error code 2350' when installing ESET Smart Security.
80. The cabinet file '[filename]' required for this installation is corrupt and cannot be used Error 1335 The cabinet file '[filename]' required for this installation is corrupt and cannot be used. This error could indicate a network error, an error reading from the CD-ROM, or a problem with this package.
81. The category '|' you entered is invalid Error 32501 The category '|' you entered is [email protected]@@[email protected]@@1.
82. The certificate expired on (date) Error sec_error_expired_certificate (site name) uses an invalid security certificate. The certificate expired on (date). (Error code: sec_error_expired_certificate). The certificate expired on (date). This error occurs when a website's identity certification has expired.
83. The certificate is not trusted because it is self signed Error sec_error_ca_cert_invalid (site name) uses an invalid security certificate. The certificate is not trusted because it is self signed. (Error code: sec_error_ca_cert_invalid). The certificate is not trusted because it is self signed.
84. The certificate is not trusted because it is self signed Error sec_error_untrusted_issuer (site name) uses an invalid security certificate. The certificate is not trusted because it is self signed. (Error code: sec_error_untrusted_issuer). The certificate is not trusted because it is self signed.
85. The certificate is not trusted because the issuer certificate has expired Error sec_error_expired_issuer_certificate (site name) uses an invalid security certificate. The certificate is not trusted because the issuer certificate has expired. The certificate will not be valid until (date). (Error code: sec_error_expired_issuer_certificate). Certificate will not be valid
86. The certificate is not trusted because the issuer certificate is unknown Error sec_error_unknown_issuer (site name) uses an invalid security certificate. The certificate is not trusted because the issuer certificate is unknown. (Error code: sec_error_unknown_issuer).
87. The certificate is only valid for (site name) Error ssl_error_bad_cert_domain (site name) uses an invalid security certificate. The certificate is only valid for (site name). (Error code: ssl_error_bad_cert_domain). This error is telling you that the certificate sent to you by the site is actually for another site.
88. The changes you made can't be saved Error 2111 The changes you made can't be [email protected] save operation may have failed due to the temporary locking of the records by another user.* Click OK to try again. You may need to click OK several times (or wait until the other user closes the table).* Click Can
89. The client has connected Error 0x81000319 The client has connected. This is returned in cases where the client should be offline. IM_e_server_unavailable.
90. The Clipboard isn't available Error 2694 The Clipboard isn't [email protected] Clipboard may be in use by another application, or your computer may be low on [email protected] your computer is low on memory, close unneeded programs, and then try the operation again.For more information on freeing memory,
91. The Clipboard isn't responding, so Microsoft Office Access can't paste the Clipboard's contents Error 2226 The Clipboard isn't responding, so Microsoft Office Access can't paste the Clipboard's [email protected]* Another application may be using the Clipboard.* There may not be enough free memory for the paste operation.Close all other applications, and then copy and
92. The code contains a syntax error, or a Microsoft Office Access function you need is not available Error 2189 The code contains a syntax error, or a Microsoft Office Access function you need is not [email protected] the syntax is correct, check the Control Wizards subkey or the Libraries key in the Microsoft Office Access section of the Windows Registry to verify tha
93. The column heading is too tall to fit on the page Error 10251 The column heading is too tall to fit on the page. Part of the heading will be cut [email protected] you want to print the incomplete [email protected] prevent headings from being cut off, try one or more of the following: * Change the page orientation to Portrait in the
94. The command name can't be blank Error 2053 The command name can't be [email protected] choose a [email protected]@[email protected]@@1.
95. The command name must be shorter than 255 Characters Error 2062 The command name must be shorter than 255 [email protected] choose a [email protected]@[email protected]@@1.
96. The command or action '|' isn't available now Error 2046 The command or action '|' isn't available [email protected]* You may be in a read-only database or an unconverted database from an earlier version of Microsoft Office Access.* The type of object the action applies to isn't currently selected or isn't in the active vi
97. The command you specified is not available in an.mde Error 7802 The command you specified is not available in an.mde,.accde, or.ade [email protected]@@[email protected]@@1.
98. The component doesn't support Automation Error 2774 The component doesn't support [email protected] tried to run a Visual Basic procedure that references an Automation [email protected] the component's documentation for information on whether it supports [email protected]@@@1.
99. The connection string is too long Error 3210 The connection string is too long. The connection string cannot exceed 255 characters.
100. The connection string of this page specifies an absolute path Error 8097 The connection string of this page specifies an absolute path. The page might not be able to connect to data through the network. To connect through a network, edit the connection string to specify a network (UNC) [email protected]&Don't show this warning [email protected]
101. The connection to the server has failed Error 0x800CCC0E The connection to the server has failed. Account: 'your_account', Server: 'mail.isot.com', Protocol: SMTP, Port: 25, Secure(SSL): NO, Socket error: 10061, Error Number: 0x800ccc0e. SICILY_LOGON_FAILED.
102. The constant you entered for the control type is invalid Error 2149 The constant you entered for the control type is [email protected] a list of valid constants you can use to create a control, click [email protected]@[email protected]@[email protected]
103. The contents of the Clipboard have been deleted and can't be pasted Error 2541 The contents of the Clipboard have been deleted and can't be [email protected] applications do not put large objects on the Clipboard. Instead, they put a pointer to the object on the Clipboard. The pointer may vanish before the paste [email protected]@[email protected]@@1.
104. The control '|' the macro is attempting to search can't be searched Error 2173 The control '|' the macro is attempting to search can't be [email protected] one of the following: * Add a GoToControl action before the FindRecord action.* For the FindRecord action, change the Only Current Field action argument from Yes to No.* Change the f
105. The Control ID '|' is already in use Error 2908 The Control ID '|' is already in use. Specify a different ID for the [email protected]@@@@@1.
106. The control name '|' is misspelled or refers to a control that doesn't exist Error 32004 The control name '|' is misspelled or refers to a control that doesn't [email protected] the invalid control name is in a macro, an Action Failed dialog box will display the macro name and the macro's arguments after you click OK. Open the Macro window, and enter
107. The control name you entered doesn't follow Microsoft Office Access object-naming rules Error 2123 The control name you entered doesn't follow Microsoft Office Access object-naming [email protected]@@[email protected]@[email protected]
108. The control number you specified is greater than the number of controls Error 2458 The control number you specified is greater than the number of [email protected] the Count property to count the controls on the form or report and then check that the control number you cite is within the range of existing [email protected]@[email protected]@[email protected]
109. The control or subform control is too large for this location Error 2100 The control or subform control is too large for this [email protected] number you entered for the Left, Top, Height, or Width property is too large or is a negative [email protected] the size of the control or subform control, or enter a positive [email protected]@@@1.
110. The Create From Macro command only works when a macro is selected in the Navigation Pane Error 2081 The Create From Macro command only works when a macro is selected in the Navigation [email protected]@@[email protected]@@1.
111. The current database '|' has more than one data file and can't be copied Error 7833 The current database '|' has more than one data file and can't be [email protected]@@[email protected]@@1.
112. The current database '|' is replicated and can't be copied until you disable replication Error 7832 The current database '|' is replicated and can't be copied until you disable replication. Use Microsoft SQL Server Enterprise Manager to remove publications and subscriptions before copying the database [email protected]@@[email protected]@@1.
113. The current database '|1' has |2 active connections Error 7827 The current database '|1' has |2 active connections. Microsoft Office Access must disconnect all applications before you can copy the database file. What do you want to do to all the active connections?&Disconnect[email protected]@@[email protected]@@.
114. The current file format no longer supports user-level security Error 3832 The current file format no longer supports user-level security. The conversion or compaction process has removed any user-level permissions.
115. The current record in |1 |2 must be saved before you can complete this operation Error 6030 The current record in |1 |2 must be saved before you can complete this [email protected] you want to save the current record in |1 |[email protected]@[email protected]@@1.
116. The current record was not unique Error 10808 The current record was not unique. All identical records were exported.
117. The current selection does not contain any fields that can be checked for spelling errors Error 9534 The current selection does not contain any fields that can be checked for spelling [email protected] can check the spelling of text box controls with Text or Memo data [email protected]@[email protected]@@1.
118. The current user account doesn't have permission to convert or enable this database Error 29024 The current user account doesn't have permission to convert or enable this [email protected] convert or enable a database, ensure the following: * You must join the workgroup that defines the user accounts used to access the database.* Your user account must h
119. The current user account doesn't have permission to make an MDE file from this database Error 29051 The current user account doesn't have permission to make an MDE file from this [email protected] make an MDE file, do the following: * Join the workgroup that defines the user accounts used to access the database.* Make sure the user account has Open/Run and O
120. The data binding DLL, 'item', could not be loaded. Error 523 Unable to load specified data binding DLL. Make sure the DLL is installed on your system.
121. The data definition of this data access page has been corrupted and can't be repaired Error 2876 The data definition of this data access page has been corrupted and can't be repaired. You must recreate the page. Save has been disabled.
122. The data has been changed Error 7878 The data has been [email protected] user edited this record and saved the changes before you attempted to save your [email protected] the [email protected]@@@1.
123. The data in the Clipboard isn't recognizable; Microsoft Office Access can't paste the OLE object Error 2243 The data in the Clipboard isn't recognizable; Microsoft Office Access can't paste the OLE [email protected]@@[email protected]@@1.
124. The data on the Clipboard is damaged, so Microsoft Office Access can't paste it Error 2227 The data on the Clipboard is damaged, so Microsoft Office Access can't paste [email protected] may be an error in the Clipboard, or there may not be enough free memory. Try the operation [email protected]@[email protected]@@1.
125. The data type for field '|' is of type Attachment and cannot be changed Error 7923 The data type for field '|' is of type Attachment and cannot be [email protected]@@[email protected]@@1.
126. The database '|' can't be repaired or isn't a Microsoft Office Access database file Error 2317 The database '|' can't be repaired or isn't a Microsoft Office Access database [email protected]@@[email protected]@@1.
127. The database '|' is already in use by another person or process Error 3196 The database '|' is already in use by another person or process. When the database is available, try the operation again.
128. The database '|' is already open as a library database Error 2274 The database '|' is already open as a library [email protected]@@[email protected]@@1.
129. The database '|' is read-only Error 2083 The database '|' is [email protected] can't save changes made to data or object definitions in this [email protected]@[email protected]@@1.
130. The database '|' is read-only Error 8400 The database '|' is [email protected] won't be able to save changes made to data or object definitions in this [email protected]@[email protected]@[email protected]
131. The database '|' you tried to delete and replace is read-only and can't be deleted or replaced Error 2547 The database '|' you tried to delete and replace is read-only and can't be deleted or [email protected] a different name for the new [email protected]@[email protected]@@1.
132. The Database administrative components failed to load or initialize Error 7746 The Database administrative components failed to load or initialize. Verify that the components are installed and registered locally.
133. The database cannot be opened because the VBA project contained in it cannot be read Error 29081 The database cannot be opened because the VBA project contained in it cannot be read. The database can be opened only if the VBA project is first deleted. Deleting the VBA project removes all code from modules, forms and reports. You should back up your d
134. The database file '|' is already open Error 7817 The database file '|' is already open. You cannot encode to an open [email protected]@@[email protected]@@1.
135. The database must be closed prior to synchronization Error 7716 The database must be closed prior to [email protected] you want Microsoft Office Access to close the database and synchronize with '|'[email protected]@[email protected]@@2.
136. The database name for the attached database file is blank Error 30028 The database name for the attached database file is blank. Enter a name for your database.
137. The database object type isn't supported by the Microsoft Office Access transfer operation Error 7826 The database object type isn't supported by the Microsoft Office Access transfer [email protected]@@[email protected]@@1.
138. The database transfer operation failed Error 7840 The database transfer operation failed. The destination database '|' was created and is in an unknown state. What would you like to do with the destination database?&Keep[email protected]@@[email protected]@@.
139. The database | is already open Error 2577 The database | is already [email protected] the database before carrying out the Make MDE File [email protected]@[email protected]@@1.
140. The database | was created in an earlier version of Microsoft Office Access Error 29017 The database | was created in an earlier version of Microsoft Office [email protected] this database to the current version of Microsoft Office Access by using the Convert Database command on the Tools menu (Database Utilities submenu)[email protected]@[email protected]@@1.
141. The default data type you selected is not supported in all versions of Microsoft SQL Server Error 7919 The default data type you selected is not supported in all versions of Microsoft SQL [email protected] the server doesn't support the data type you have chosen, the varchar data type will be used in its [email protected]@[email protected]@@1.
142. The default printer driver isn't set up correctly Error 2204 The default printer driver isn't set up [email protected] information on setting a default printer, search the Microsoft Windows Help index for 'default printer, setting'[email protected]@[email protected]@@1.
143. The default printer driver isn't set up correctly Error 2205 The default printer driver isn't set up [email protected] information on setting a default printer, search the Microsoft Windows Help index for 'default printer, setting'[email protected]@[email protected]@@1.
144. The destination file '|' already exists Error 7841 The destination file '|' already exists. Set the Overwrite flag to TRUE if you want to replace the existing [email protected]@@[email protected]@@1.
145. The Docking property can't be set to '|1' at this time Error 2071 The Docking property can't be set to '|1' at this [email protected] you want to set the Docking property to '|2', move the toolbar from its current position and try [email protected]@[email protected]@@1.
146. The dynamic-link library Commdlg failed: error code '0x|' Error 2203 The dynamic-link library Commdlg failed: error code '0x|'[email protected] printer driver for the selected printer may be incorrectly installed.For information on selecting another printer or reinstalling this printer from Microsoft Windows, search the Windows Help i
147. The e-mail address field you have specified does not contain any valid addresses Error 31661 The e-mail address field you have specified does not contain any valid addresses. Specify another field.
148. The event procedure '|' can't be a Function procedure; it must be a Sub procedure Error 2479 The event procedure '|' can't be a Function procedure; it must be a Sub [email protected] you want to run a Function procedure when an event occurs, try one of the following: * Set the event property to the name of a macro containing a RunCode action that run
149. The exception unknown software exception (0x0eedfade) occured in the application at location 0x7c59bbf3 Error 0x0EEDFADE The exception unknown software exception (0x0eedfade) occured in the application at location 0x7c59bbf3. Avant Browser errors when clearing records.
150. The existing data violates the '|1' property for field '|2 Error 10028 The existing data violates the '|1' property for field '|2.'@If you continue testing, Microsoft Office Access will inform you if data violates any other property settings in the table.Would you like to continue [email protected]@[email protected]@@2.
151. The existing | will be deleted before you run the query Error 10513 The existing | will be deleted before you run the [email protected] you want to continue [email protected]@[email protected]@@2.
152. The Exit or Update operation failed Error 2751 The Exit or Update operation [email protected] pressed the ESC key (or another key used in the OLE server to stop an operation) while Microsoft Office Access was saving the changes you made to an OLE object in a form or [email protected] to exit or update [email protected]@@@
153. The expression '|' is invalid Error 2589 The expression '|' is [email protected] functions are only allowed on output fields of the Record Source. @@[email protected]@@1.
154. The expression '|' you entered is invalid Error 2055 The expression '|' you entered is [email protected]@@[email protected]@[email protected]
155. The expression you are trying to use for the DefaultValue property is invalid because '|' Error 3406 The expression you are trying to use for the DefaultValue property is invalid because '|'. Use a valid expression to set this property.
156. The expression you entered contains invalid syntax Error 2431 The expression you entered contains invalid [email protected] may have entered a comma without a preceding value or [email protected]@[email protected]@@1.
157. The expression you entered contains invalid syntax Error 2433 The expression you entered contains invalid [email protected] may have entered an operator, such as the + operator, in an expression without a corresponding [email protected]@[email protected]@@1.
158. The expression you entered contains invalid syntax Error 2434 The expression you entered contains invalid [email protected] may have entered an operand without an [email protected]@[email protected]@@1.
159. The expression you entered contains invalid syntax Error 2438 The expression you entered contains invalid [email protected] omitted an operand or operator, you entered an invalid character or comma, or you entered text without surrounding it in quotation [email protected]@[email protected]@[email protected]
160. The expression you entered contains invalid syntax, or you need to enclose your text data in quotes Error 2432 The expression you entered contains invalid syntax, or you need to enclose your text data in [email protected] may have entered an invalid comma or omitted quotation marks.For example, if the Default Value property of a text field is ''Huey, Louie, and Dewey,''
161. The expression you entered exceeds the 1,024-character limit for the query design grid Error 2340 The expression you entered exceeds the 1,024-character limit for the query design [email protected]@@[email protected]@@1.
162. The expression you entered has a function containing the wrong number of arguments Error 2439 The expression you entered has a function containing the wrong number of [email protected]@@[email protected]@@1.
163. The expression you entered has a function name that Microsoft Office Access can't find Error 2425 The expression you entered has a function name that Microsoft Office Access can't [email protected]@@[email protected]@@1.
164. The expression you entered has an invalid Error 2423 The expression you entered has an invalid. (dot) or ! operator or invalid [email protected] may have entered an invalid identifier or typed parentheses following the Null [email protected]@[email protected]@[email protected]
165. The expression you entered has an invalid date value Error 2421 The expression you entered has an invalid date [email protected]@@[email protected]@[email protected]
166. The expression you entered has an invalid number Error 2420 The expression you entered has an invalid [email protected]@@[email protected]@[email protected]
167. The expression you entered has an invalid reference to the Dynaset property Error 2466 The expression you entered has an invalid reference to the Dynaset [email protected] example, you may have used the Dynaset property with a form that isn't based on a table or [email protected]@[email protected]@@1.
168. The expression you entered has an invalid reference to the Parent property Error 2452 The expression you entered has an invalid reference to the Parent [email protected] example, you may be using the Parent property with a control on a main form or report rather than with a control on a subform or [email protected]@[email protected]@[email protected]
169. The expression you entered has an invalid string Error 2422 The expression you entered has an invalid [email protected] string can be up to 2048 characters long, including opening and closing quotation [email protected]@[email protected]@@1.
170. The expression you entered has invalid parentheses Error 2442 The expression you entered has invalid [email protected] may have used the parenthesis syntax for an identifier in a query. Use the standard identifier syntax: Forms![Form]![Control][email protected]@[email protected]@[email protected]
171. The expression you entered has invalid vertical bars (|) Error 2437 The expression you entered has invalid vertical bars (|)[email protected]@@[email protected]@@1.
172. The expression you entered has too many closing parentheses Error 2435 The expression you entered has too many closing [email protected]@@[email protected]@@1.
173. The expression you entered in the Specification Name argument exceeds the 64-character limit Error 2510 The expression you entered in the Specification Name argument exceeds the 64-character [email protected] one of the existing specification names from the argument list box when you use the TransferText action in a macro, or enter a name in Visual Basic that f
174. The expression you entered is missing a closing parenthesis, bracket (]), or vertical bar (|) Error 2436 The expression you entered is missing a closing parenthesis, bracket (]), or vertical bar (|)[email protected]@@[email protected]@@1.
175. The expression you entered is too complex Error 2445 The expression you entered is too [email protected]@@[email protected]@[email protected]
176. The expression you entered refers to an object that is closed or doesn't exist Error 2467 The expression you entered refers to an object that is closed or doesn't [email protected] example, you may have assigned a form to a Form object variable, closed the form, and then referred to the object [email protected]@[email protected]@@1.
177. The expression you entered requires the control to be in the active window Error 2474 The expression you entered requires the control to be in the active [email protected] one of the following: * Open or select a form or report containing the control.* Create a new control in the active window, and try the operation [email protected]@[email protected]@@1.
178. The expression you entered requires the control to be in the active window Error 7954 The expression you entered requires the control to be in the active [email protected] one of the following: * Open or select a form or report containing the control.* Create a new control in the active window, and try the operation [email protected]@[email protected]@@1.
179. The expression |2 you entered as the event property setting produced the following error: |1 Error 2473 The expression |2 you entered as the event property setting produced the following error: |[email protected]* The expression may not result in the name of a macro, the name of a user-defined function, or [Event Procedure].* There may have been an error evaluating the f
180. The expression |2 you entered in the form control's ValidationRule property contains the error |1 Error 2469 The expression |2 you entered in the form control's ValidationRule property contains the error |[email protected] Office Access can't parse the ValidationRule expression you entered. For example, if you enter the expression =MyFunction() in the ValidationRule
181. The feature '|' is not available while the database is opened in disabled mode Error 2537 The feature '|' is not available while the database is opened in disabled [email protected]@@[email protected]@@1.
182. The feature can not be used Error 1000 The feature can not be used. Such a message can occur if ICQ is not able to establish one or another option that you want to add.
183. The feature can not be used Error 501 The feature can not be used. Such a message can occur if ICQ is not able to establish one or another option that you want to add.
184. The feature can not be used Error 502 The feature can not be used. Such a message can occur if ICQ is not able to establish one or another option that you want to add.
185. The feature can not be used Error 503 The feature can not be used. Such a message can occur if ICQ is not able to establish one or another option that you want to add.
186. The feature can not be used Error 504 The feature can not be used. Such a message can occur if ICQ is not able to establish one or another option that you want to add.
187. The feature can not be used Error 505 The feature can not be used. Such a message can occur if ICQ is not able to establish one or another option that you want to add.
188. The feature can not be used Error 601 The feature can not be used. Such a message can occur if ICQ is not able to establish one or another option that you want to add.
189. The feature can not be used Error 602 The feature can not be used. Such a message can occur if ICQ is not able to establish one or another option that you want to add.
190. The feature can not be used Error 603 The feature can not be used. Such a message can occur if ICQ is not able to establish one or another option that you want to add.
191. The feature can not be used Error 604 The feature can not be used. Such a message can occur if ICQ is not able to establish one or another option that you want to add.
192. The feature can not be used Error 605 The feature can not be used. Such a message can occur if ICQ is not able to establish one or another option that you want to add.
193. The feature can not be used Error 606 The feature can not be used. Such a message can occur if ICQ is not able to establish one or another option that you want to add.
194. The feature can not be used Error 607 The feature can not be used. Such a message can occur if ICQ is not able to establish one or another option that you want to add.
195. The feature can not be used Error 608 The feature can not be used. Such a message can occur if ICQ is not able to establish one or another option that you want to add.
196. The feature can not be used Error 609 The feature can not be used. Such a message can occur if ICQ is not able to establish one or another option that you want to add.
197. The feature can not be used Error 610 The feature can not be used. Such a message can occur if ICQ is not able to establish one or another option that you want to add.
198. The feature can not be used Error 611 The feature can not be used. Such a message can occur if ICQ is not able to establish one or another option that you want to add.
199. The feature can not be used Error 612 The feature can not be used. Such a message can occur if ICQ is not able to establish one or another option that you want to add.
200. The feature can not be used Error 613 The feature can not be used. Such a message can occur if ICQ is not able to establish one or another option that you want to add.
201. The feature can not be used Error 614 The feature can not be used. Such a message can occur if ICQ is not able to establish one or another option that you want to add.
202. The field is too small to accept the amount of data you attempted to add Error 3163 The field is too small to accept the amount of data you attempted to add. Try inserting or pasting less data.
203. The field name is missing in row | Error 10602 The field name is missing in row |[email protected] haven't selected a matching field for this relationship in each row of the [email protected] fields so that the grid has the same number of fields on the left and right sides, and then try to create the relationship agai
204. The field name is not valid Error 2372 The field name is not [email protected] sure that the name doesn't contain a period (.), exclamation point (!), bracket ([]), leading space, or non-printable character such as a carriage return. If you have pasted the name from another application, try pressing
205. The field name you entered exceeds the 64-character limit of the LinkMasterFields property Error 2325 The field name you entered exceeds the 64-character limit of the LinkMasterFields [email protected] you use the Relationships command (on the Database Tools tab, click Relationships) to define a relationship between the tables underlying a form and subform,
206. The file 'item' is out of date. This program requires a newer version Error 368 An ActiveX control was found to be out of date.
207. The file '|' already exists Error 10958 The file '|' already exists. Replace existing [email protected]@@[email protected]@@1.
208. The file '|' already exists Error 2308 The file '|' already [email protected] you want to replace the existing [email protected]@[email protected]@@2.
209. The file '|' already exists Error 32611 The file '|' already [email protected] you want to update the existing [email protected]@[email protected]@@2.
210. The file '|' already exists Error 8402 The file '|' already [email protected] you want to replace the existing file?If you want to compact or convert to a different file name, click No. Enter the new file name after the /compact or /convert option in the command line, and run the command [email protected]@[email protected]@
211. The file '|' cannot be opened because it has been locked by another user Error 8417 The file '|' cannot be opened because it has been locked by another [email protected] again when the file is [email protected]@[email protected]@@1.
212. The file '|' does not exist Error 7889 The file '|' does not [email protected]@@[email protected]@@1.
213. The file '|' doesn't contain any data Error 7890 The file '|' doesn't contain any [email protected] can't import from, or link to, an empty [email protected]@[email protected]@@1.
214. The file '|' is incompatible Error 2058 The file '|' is incompatible. Microsoft Office Access needs to be [email protected] Setup to reinstall Microsoft Office Access. If you want to preserve your security or custom settings, back up the Microsoft Office Access workgroup information file.For mor
215. The file '|' is not readable by the Access database engine Error 9504 The file '|' is not readable by the Access database engine. @If you think you have a valid Access database, this is most likely because of the recent file format change. Do you want to attempt to upgrade the database [email protected]@[email protected]@@2.
216. The file cannot be installed Error 1334 ERROR 1334. The file 'Global_VC_CPPRT60_f0.51D569E3_8A28_11D2_B962_006097C4DE24' cannot be installed.
217. The file could not be copied Error 5 The file could not be copied. Error code: 5.
218. The file is not in the correct format for a Microsoft Office Access project Error 2025 The file is not in the correct format for a Microsoft Office Access [email protected]@@[email protected]@@1.
219. The file name '|' is too long Error 2223 The file name '|' is too [email protected] a file name that's 256 characters or [email protected]@[email protected]@@1.
220. The file name argument in the GetObject function of the Visual Basic procedure you ran is invalid Error 2711 The file name argument in the GetObject function of the Visual Basic procedure you ran is [email protected]* You may not have entered, or may have misspelled, the file name.* The unit of data (such as a range of cells from a worksheet) may not be [email protected] one o
221. The file name extension of '|' is not valid for the format to which you are trying to export Error 32592 The file name extension of '|' is not valid for the format to which you are trying to export. This action is potentially unsafe. Do you want to continue? @@@[email protected]@@2.
222. The file path you specified is not valid Error 32591 The file path you specified is not valid. Please specify a full file [email protected]@@[email protected]@@1.
223. The file specified is out of date. This program requires a later version Error 368 An ActiveX control was found to be out of date.
224. The file you specified doesn't contain valid icon data Error 2245 The file you specified doesn't contain valid icon [email protected] a valid icon [email protected]@[email protected]@[email protected]
225. The File ‘InstallAX64.exe” is not marked for installation Error 2753 The File ‘InstallAX64.exe” is not marked for installation. Adobe Flash Player Install Error.
226. The filter operation was canceled Error 7769 The filter operation was canceled. The filter would be too [email protected]@@[email protected]@@1.
227. The filters defining a partial replica have been changed Error 3570 The filters defining a partial replica have been changed. The partial replica must be repopulated.
228. The FindRecord action requires a Find What argument Error 2142 The FindRecord action requires a Find What [email protected] tried to run a macro set to one of the current field's properties, but you left the Find What argument [email protected] you click OK, an Action Failed dialog box will display the macro name and the macro
229. The following errors have occurred: Error 32518 The following errors have occurred: .
230. The form name '|' is misspelled or refers to a form that doesn't exist Error 2102 The form name '|' is misspelled or refers to a form that doesn't [email protected] the invalid form name is in a macro, an Action Failed dialog box will display the macro name and the macro's arguments after you click OK. Open the Macro window, and enter the corr
231. The form name you entered doesn't follow Microsoft Office Access object-naming rules Error 2124 The form name you entered doesn't follow Microsoft Office Access object-naming [email protected]@@[email protected]@[email protected]
232. The form or report '|' has too many controls Error 29055 The form or report '|' has too many [email protected] the number of controls on the form or report before using it in this version of Microsoft Office [email protected]@[email protected]@@1.
233. The form or report includes more OLE objects than Microsoft Office Access can display at one time Error 2680 The form or report includes more OLE objects than Microsoft Office Access can display at one [email protected] some of the bound or unbound object [email protected]@[email protected]@@1.
234. The form or report template is open in Design view Error 6018 The form or report template is open in Design view. Before creating a new form or report, close the corresponding [email protected]@@[email protected]@@1.
235. The format condition number you specified is greater than the number of format conditions Error 7966 The format condition number you specified is greater than the number of format [email protected] the Count property to count the format conditions for the control and then check that the format condition number you cite is within the range of existing forma
236. The format condition Operator you specified is invalid Error 7969 The format condition Operator you specified is [email protected] values for the Operator property are 0 to [email protected]@[email protected]@@1.
237. The format condition Type you specified is invalid Error 7968 The format condition Type you specified is [email protected] values for the Type property are 0 to 2 for the first condition, and 0 to 1 for all other format [email protected]@[email protected]@@1.
238. The format in which you are attempting to output the current object is not available Error 2282 The format in which you are attempting to output the current object is not [email protected] you are attempting to output the current object to a format that is not valid for its object type, or the formats that enable you to output data as a Microsoft Ex
239. The format specification for '|' is invalid Error 2283 The format specification for '|' is [email protected] can't save output data to a file in this format until you correct the setting for the format in the Windows Registry. Run Setup to reinstall Microsoft Office Access or, if you're familiar with the settings
240. The function call is invalid Error 97 Error 97: Comodo Cloud Drive has encountered a problem and needs to close. We are sorry for the inconvenience.
241. The function name is too long Error 29010 The function name is too [email protected] Office Access will truncate the function name to 255 [email protected]@[email protected]@[email protected]
242. The function you are trying to use can not be accessed at this time Error 222 A The function you are trying to use can not be accessed at this time. ICQ will now exit. To fix this problem, try to close other open applications or restart Windows.
243. The function you entered can't be used in this expression Error 2426 The function you entered can't be used in this [email protected]* You may have used a DoEvents, LBound, UBound, Spc, or Tab function in an expression.* You may have used an aggregate function, such as Count, in a design grid or in a calculated control or field
244. The given bookmark was invalid Error 527 You tried to set a bookmark to an invalid string.
245. The group '|' you entered is invalid Error 32500 The group '|' you entered is [email protected]@@[email protected]@@1.
246. The grouping level that you are trying to delete has a group header or group footer section Error 8529 The grouping level that you are trying to delete has a group header or group footer section. The section contains controls that will also be [email protected] you want to [email protected]@[email protected]@@2.
247. The Hangul Hanja Converter can't proceed Error 9543 The Hangul Hanja Converter can't proceed. There is no Hangul or Hanja data to [email protected]@@[email protected]@@1.
248. The HTML file associated with this link has been moved, renamed, or deleted Error 8415 The HTML file associated with this link has been moved, renamed, or [email protected]: '|'&Update Link.[email protected]@[email protected]@@2.
249. The HyperlinkAddress or HyperlinkSubAddress property is read-only for this hyperlink Error 7980 The HyperlinkAddress or HyperlinkSubAddress property is read-only for this [email protected]@@[email protected]@@1.
250. The IMVU service could not be reached Error 11001 The IMVU service could not be reached. Please check your internet connection and try again. .
251. The In operator you entered requires parentheses Error 2429 The In operator you entered requires [email protected]@@[email protected]@@1.
252. The index for the Action or the Verb property for the | object is invalid Error 2715 The index for the Action or the Verb property for the | object is [email protected] setting you entered may be a negative number or may be too [email protected]@[email protected]@[email protected]
253. The index name is invalid Error 2394 The index name is [email protected] index name may be too long (over 64 characters) or contain invalid [email protected]@[email protected]@@1.
254. The index number you used to refer to the module is invalid Error 7962 The index number you used to refer to the module is [email protected] the Count property to count the open modules and make sure that the module number is not greater than the number of open modules minus [email protected]@[email protected]@@1.
255. The input string is too long Error 2315 The input string is too [email protected]@@[email protected]@@1.
256. The INSERT INTO statement contains the following unknown field name: '|' Error 3127 The INSERT INTO statement contains the following unknown field name: '|'. Make sure you have typed the name correctly, and try the operation again.
257. The installation file is damaged or incomplete Error #13 The installation file is damaged or incomplete. The installation file is damaged or incomplete. You need to download it again.
258. The installation source for this product is not available Error 1612, 1635 The installation source for this product is not available. Verify that the source exists and that you can access it. This patch package could not be opened. Verify that the patch package exists and that you can access it. Or, contact the application vendo
259. The installer encountered an unexpected error installing this package Error 2324 The installer encountered an unexpected error installing this package. This may indicate a problem with this package. The error code is 2324. Firefox will not start after upgrade.
260. The installer has encountered an unexpected error installing this package Error 2753 The installer has encountered an unexpected error installing this package. This may indicate a problem with this package. The error code is 2753.
261. The installer has encountered an unexpected error installing this package Error 2878 The installer has encountered an unexpected error installing this package. This may indicate a problem with this package. The error code is 2878.
262. The Installer has insufficient privileges to access this director Error 1303 Error 1303. The Installer has insufficient privileges to access this directory: C\Program Files\Common Files\Corel\Shared\Shell Extension. The installation cannot continue. Log on as Administrator or contact your system administator.
263. The Installer has insufficient privileges to modify this file: c: \Windows\system32\Macromed\Flash\FlashPlayerTrust\AcrobatConnect Error 1321 The Installer has insufficient privileges to modify this file: c:\Windows\system32\Macromed\Flash\FlashPlayerTrust\AcrobatConnect.cfg.
264. The instruction at 0x00117186 referenced memory at 0x79e0b805 Error 0x00117186 The instruction at 0x00117186 referenced memory at 0x79e0b805. The memory could not be read. Click on OK to terminate the program.
265. The iPhone [device name] could not be restored Error 21 "The iPhone ""iPhone"" could not be restored. An unknown error occurred (21)."
266. The iPhone [device name] could not be restored Error 4005 The iPhone [device name] could not be restored. An unknown error occurred (4005).
267. The iPhone [device name] could not be restored Error 4013 The iPhone [device name] could not be restored. An unknown error occurred (4013).
268. The iPhone [device name] could not be restored Error 4014 The iPhone [device name] could not be restored. An unknown error occurred (4014).
269. The item on the Clipboard can't be pasted into this control Error 2112 The item on the Clipboard can't be pasted into this [email protected]@@[email protected]@@1.
270. The key or key combination |1 in |2 has invalid syntax or is not allowed Error 2069 The key or key combination |1 in |2 has invalid syntax or is not [email protected] the SendKeys syntax to specify the key or key combinations.For the allowed key or key combinations, click [email protected]@[email protected]@[email protected]
271. The layout of the Relationships window will be cleared Error 10605 The layout of the Relationships window will be [email protected] you want to [email protected]@[email protected]@@2.
272. The license period of the OTC entered has expired Error 556 The license period of the OTC entered has expired. License installation fails.
273. The list |1 is already used by the |2 link table Error 32600 The list |1 is already used by the |2 link table. Select a different list.
274. The Macro Conversion Wizard can't be started Error 7881 The Macro Conversion Wizard can't be [email protected] wizard may not be installed, or this wizard has been [email protected] reenable this wizard, click the Microsoft Office Button, and then click Access Options. Click Add-Ins, and then in the Manage list, click
275. The Maximum Record Count setting cannot be a negative number Error 6023 The Maximum Record Count setting cannot be a negative [email protected]@@[email protected]@@1.
276. The Maximum Record Count setting cannot contain text - please enter a number Error 6024 The Maximum Record Count setting cannot contain text - please enter a [email protected]@@[email protected]@@1.
277. The menu bar value '|' is invalid Error 2064 The menu bar value '|' is [email protected] supplied an argument to the DoMenuItem method that refers to a menu bar that is [email protected] an intrinsic constant or numeric value that refers to a valid menu bar value, such as [email protected]@[email protected]@1.
278. The message could not be sent to the SMTP server Error 0x800CCC15 The message could not be sent to the SMTP server. The transport error code was 0x800ccc15. The server response was not available. SMTP Problems on server with McAfee VirusScan 8.0.
279. The message text is too long, so it was not sent Error 2292 The message text is too long, so it was not [email protected]@@[email protected]@@1.
280. The method you tried to invoke on an object failed Error 2759 The method you tried to invoke on an object [email protected]* You may have specified too many or too few arguments for a property or method of an object. Check the component's documentation for information on the properties and methods it makes available for Auto
281. The Microsoft Office Access database engine cannot find the input table or query '|' Error 3078 The Microsoft Office Access database engine cannot find the input table or query '|'. Make sure it exists and that its name is spelled correctly.
282. The Microsoft Office Access database engine cannot open or write to the file '|' Error 3051 The Microsoft Office Access database engine cannot open or write to the file '|'. It is already opened exclusively by another user, or you need permission to view and write its data.
283. The Microsoft Office Access database engine could not find the object '|' Error 3011 The Microsoft Office Access database engine could not find the object '|'. Make sure the object exists and that you spell its name and the path name correctly.
284. The Microsoft Office Access Outlook Add-in is disabled in Microsoft Office Outlook 2007 Error 32596 The Microsoft Office Access Outlook Add-in is disabled in Microsoft Office Outlook 2007. To collect data by using e-mail messages in Microsoft Office Access 2007, verify that this add-in is installed and enabled from within Office Outlook 2007.
285. The Microsoft Office Access Source Code Control Add-in could not be started Error 7992 The Microsoft Office Access Source Code Control Add-in could not be [email protected]@@[email protected]@@3.
286. The module name '|' is invalid Error 29019 The module name '|' is [email protected]* The module name may start with the prefix Form_ or Report_.* The module can't be named Forms, Reports, Modules, Application, Screen, Assistant, CommandBars, References, or DoCmd.* The module name may have too many charact
287. The module name '|' is misspelled or refers to a module that doesn't exist Error 29062 The module name '|' is misspelled or refers to a module that doesn't [email protected] the invalid module name is in a macro, an Action Failed dialog box will display the macro name and the macro's arguments after you click OK. Open the Macro window, and enter th
288. The name '|' is already in use Error 31603 The name '|' is already in use. Enter a different name or click on the Manage Data Tasks button to rename the existing specification. @@@[email protected]@@1.
289. The name '|' is already in use Error 32598 The name '|' is already in use. Enter a different name. @@@[email protected]@@1.
290. The name for the menu, command, or subcommand you entered is invalid Error 2065 The name for the menu, command, or subcommand you entered is [email protected] supplied an argument to the DoMenuItem method that refers to a menu name, command, or subcommand that is [email protected] an intrinsic constant or numeric value that refers to a valid m
291. The name of this TempVar is too long Error 32540 The name of this TempVar is too long. TempVar names must be 256 characters or less. Use a shorter name.
292. The name you entered already exists for another object of the same type in this database Error 8000 The name you entered already exists for another object of the same type in this [email protected] you want to replace the existing |[email protected]@[email protected]@@2.
293. The name you entered already exists for another object of the same type in this database Error 8006 The name you entered already exists for another object of the same type in this [email protected] you want to replace the existing |? You will not be able to undo this [email protected]@[email protected]@@2.
294. The name you entered already exists for another shortcut in this group Error 8412 The name you entered already exists for another shortcut in this group. @Do you want to replace the existing shortcut '|?'@@[email protected]@@2.
295. The name you supplied is a reserved word Error 8104 The name you supplied is a reserved word. Reserved words have a specific meaning to Microsoft Office Access or to the Microsoft Office Access database engine. @If you use a reserved word, you may receive an error when referring to this [email protected]@[email protected]@[email protected]
296. The network connection to the Backup Exec Remote Agent has been lost Error 0x00084F8 The network connection to the Backup Exec Remote Agent has been lost. Check for network errors. Final error category: Resource Errors.
297. The network license manager was not able to get a valid license Error 1.5.-15 The network license manager was not able to get a valid license. If this problem continues, please contact your system administrator. Error [1.5.-15]. When you tried to launch your AutoCAD®-based software, the error message was displayed. This error indi
298. The network location cannot be reached Error 0xE0060006 The network location cannot be reached. Try Windows Help. Unable to install AVG Free 2014.
299. The new password doesn't match the verify password value Error 2634 The new password doesn't match the verify password [email protected]@@[email protected]@@1.
300. The new procedure name you provided is invalid Error 29004 The new procedure name you provided is [email protected]@@[email protected]@[email protected]
301. The number is too large Error 2263 The number is too [email protected]@@[email protected]@@1.
302. The number you entered is invalid Error 2200 The number you entered is [email protected]@@[email protected]@@1.
303. The number you used to refer to the data access page is invalid Error 2019 The number you used to refer to the data access page is [email protected] the Count property to count the open data access pages and make sure that the page number is not greater than the number of open data access pages minus [email protected]@[email protected]@[email protected]
304. The number you used to refer to the form is invalid Error 2456 The number you used to refer to the form is [email protected] the Count property to count the open forms and make sure that the form number is not greater than the number of open forms minus [email protected]@[email protected]@[email protected]
305. The number you used to refer to the form or report section is invalid Error 2148 The number you used to refer to the form or report section is [email protected] sure that the number is less than the number of sections in the form or [email protected]@[email protected]@@1.
306. The number you used to refer to the report is invalid Error 2457 The number you used to refer to the report is [email protected] the Count property to count the open reports and make sure that the report number is not greater than the number of open [email protected]@[email protected]@[email protected]
307. The number you used to reference an element in the array is outside the bounds of the array Error 2768 The number you used to reference an element in the array is outside the bounds of the [email protected] example, the array is from 0 through 10, and you entered a -1 or an [email protected] the component's documentation for information on the properties and methods it m
308. The object '|' already exists Error 10803 The object '|' already [email protected] you want to replace the existing object with the one you are exporting?If you want to export this object without replacing the existing object, click No. You can then choose a new name in the Export dialog [email protected]@[email protected]@@2.
309. The object '|' is not a valid Microsoft SQL Server database object Error 7828 The object '|' is not a valid Microsoft SQL Server database object. Microsoft Office Access can't transfer this [email protected]@@[email protected]@@1.
310. The object '|' isn't open Error 2489 The object '|' isn't [email protected]* The macro you are running (directly or indirectly) contains a GoToRecord, RepaintObject, or SelectObject action, but the Object Name argument names an object that is closed.* The objectname argument for the GoToRecord, Repaint
311. The object doesn't contain the Automation object '| Error 2766 The object doesn't contain the Automation object '|.'@You tried to run a Visual Basic procedure to set a property or method for an object. However, the component doesn't make the property or method available for Automation [email protected] the component'
312. The object doesn't have an OLE object data type Error 2685 The object doesn't have an OLE object data [email protected] bound object frame containing the object you tried to edit isn't bound to a field with the OLE object data [email protected] you want to display an OLE object, set the ControlSource property for the bound object
313. The object doesn't support American English; it was developed using a different language Error 2767 The object doesn't support American English; it was developed using a different [email protected] a version of the object developed in Visual Basic that supports the language you are [email protected]@[email protected]@@1.
314. The object name '|' you entered doesn't follow Microsoft Office Access object-naming rules Error 2006 The object name '|' you entered doesn't follow Microsoft Office Access object-naming [email protected] more information about naming objects, click [email protected]@[email protected]@[email protected]
315. The object name '|' you entered following the ! operator in the expression is invalid Error 2454 The object name '|' you entered following the ! operator in the expression is [email protected] example, you may have tried to enter an identifier with two control names separated by the ! [email protected]@[email protected]@[email protected]
316. The object that you have selected in the Object Dependencies pane no longer exists in the database Error 31567 The object that you have selected in the Object Dependencies pane no longer exists in the [email protected]@@[email protected]@@1.
317. The Object Type argument for the action or method is blank or invalid Error 2487 The Object Type argument for the action or method is blank or [email protected]* For a Close, GoToRecord, SearchForRecord or RepaintObject action, enter values for both arguments, or leave both blank to perform the action on the active object.* For a DeleteObject
318. The object type is invalid Error 2606 The object type is [email protected]@@[email protected]@@1.
319. The object you attempted to load from text has an invalid value for the property '|1' on a |2 Error 2188 The object you attempted to load from text has an invalid value for the property '|1' on a |[email protected]@@[email protected]@@1.
320. The object you entered is not a valid Recordset property Error 7965 The object you entered is not a valid Recordset [email protected] example, you may have used a forward-only recordset, or tried to set it to [email protected]@[email protected]@[email protected]
321. The object you have selected is already open for design as a subform or subreport Error 7784 The object you have selected is already open for design as a subform or subreport. To open this object in Design view, select the subform or subreport in the object in which it is already open, and then on the Design tab, in the Tools group, click Subform
322. The object you referenced in the Visual Basic procedure as an OLE object isn't an OLE object Error 2770 The object you referenced in the Visual Basic procedure as an OLE object isn't an OLE [email protected]@@[email protected]@@1.
323. The object | is currently checked in and is therefore read-only Error 7993 The object | is currently checked in and is therefore [email protected] modify the object, close it first, then check it out and reopen [email protected]@[email protected]@@1.
324. The object's property or method can't be set Error 2764 The object's property or method can't be [email protected] tried to run a Visual Basic procedure to set a property or apply a method for an object. However, the property or method doesn't support named [email protected] the component's documentation for information
325. The object/device is busy Error 15 Error 15: Comodo Cloud Drive has encountered a problem and needs to close. We are sorry for the inconvenience.
326. The OCSP server has no status for the certificate Error sec_error_ocsp_unknown_cert An error occurred during a connection to (site name). The OCSP server has no status for the certificate. (Error code: sec_error_ocsp_unknown_cert). The OCSP server has no status for the certificate.
327. The ODBC Refresh Interval setting must be from 1 through 32,766 seconds Error 2085 The ODBC Refresh Interval setting must be from 1 through 32,766 [email protected]@@[email protected]@@1.
328. The older version of Google Talk Plugin cannot be removed Error 1714 The older version of Google Talk Plugin cannot be removed. Google Talk Plugin - Error.
329. The older version of [product name] cannot be removed Error 1714 The older version of [product name] cannot be removed. Contact your technical support group.
330. The OLE object can't be activated upon receiving the focus Error 2799 The OLE object can't be activated upon receiving the [email protected] you selected an OLE object or a chart, and the AutoActivate property for that control is set to GetFocus, the OLE object or chart should be activated automatically when it receives the focus.
331. The OLE object failed to persist itself Error 6028 The OLE object failed to persist itself. You will not be able to undo this [email protected]@@[email protected]@@1.
332. The OLE object is empty Error 2684 The OLE object is [email protected] can't edit a bound object frame if the field in the underlying table doesn't contain an OLE [email protected] the field, click Insert Object, and use the dialog box to locate and add the object to the [email protected]@[email protected]@1.
333. The OLE object isn't loaded because the unbound ActiveX control hasn't been initialized Error 2801 The OLE object isn't loaded because the unbound ActiveX control hasn't been [email protected]@@[email protected]@[email protected]
334. The OLE object you tried to edit can't be accessed Error 2733 The OLE object you tried to edit can't be [email protected] don't have permission to change the object, or another user opened and locked the [email protected]@[email protected]@@1.
335. The OLE object you tried to edit is busy Error 2729 The OLE object you tried to edit is [email protected] again [email protected]@[email protected]@@1.
336. The OLE server can't display the | object Error 2747 The OLE server can't display the | [email protected] is a problem with the file containing the OLE object, or there isn't enough memory [email protected] the OLE server outside of Microsoft Office Access, and then open the OLE object file.If you can do this, th
337. The OLE server doesn't support linking Error 2786 The OLE server doesn't support [email protected] tried to run a Visual Basic procedure using the Action property. However, you provided insufficient information to establish a [email protected]@[email protected]@@1.
338. The OLE server for the OLE object you tried to create is already open Error 2701 The OLE server for the OLE object you tried to create is already [email protected] to the OLE server window and close it. Then try to create or edit the OLE object [email protected]@[email protected]@@1.
339. The OLE server isn't registered Error 2725 The OLE server isn't [email protected] register the OLE server, reinstall [email protected]@[email protected]@@1.
340. The OLE server wasn't able to open the object Error 2785 The OLE server wasn't able to open the [email protected]* The OLE server may not be installed.* You may have specified an invalid setting for the SourceDoc or SourceItem property in a property sheet, a macro, or a Visual Basic [email protected] see the valid settings
341. The operation can not be completed at this time Error 117 The operation can not be completed at this time. Please try again or Your request can not be processed at this time. Please try again.
342. The operation can not be completed at this time Error 132 The operation can not be completed at this time. Please try again or Your request can not be processed at this time. Please try again.
343. The operation can not be completed at this time Error 133 A The operation can not be completed at this time. Please try again.
344. The operation can not be completed at this time Error 136 The operation can not be completed at this time. Please try again or Your request can not be processed at this time. Please try again.
345. The operation can not be completed at this time Error 257 The operation can not be completed at this time. The default settings for ICQ will now be restored.
346. The operation can not be completed at this time Error 258 The operation can not be completed at this time. The default settings for ICQ will now be restored.
347. The operation can not be completed at this time Error 259 The operation can not be completed at this time. The default settings for ICQ will now be restored.
348. The operation could not be completed because the Smart Tag '|' is not recognized by your system Error 2098 The operation could not be completed because the Smart Tag '|' is not recognized by your [email protected]@@[email protected]@@1.
349. The operation could not be performed because the service is stopped Error 176 Error 176: Comodo Cloud Drive has encountered a problem and needs to close. We are sorry for the inconvenience.
350. The operation failed Error 3626 The operation failed. There are too many indexes on table '|'. Delete some of the indexes on the table and try the operation again.
351. The operation has timed out Error 12 The operation has timed out. This error occurs if the backup destination has long initialization time. That can be in environments like SAN or complex RAID or dynamic disk configurations.
352. The operation is only valid on a data access page opened in Design View Error 2896 The operation is only valid on a data access page opened in Design [email protected] switch the page to Design View and try the operation [email protected]@[email protected]@@1.
353. The operation on the | object failed Error 2750 The operation on the | object [email protected] OLE server may not be [email protected] register the OLE server, reinstall [email protected]@@@1.
354. The ORDER BY expression (|) includes fields that are not selected by the query Error 3351 The ORDER BY expression (|) includes fields that are not selected by the query. Only those fields requested in the first query can be included in an ORDER BY expression.
355. The page cannot be found Error 404 The page cannot be found. The page you are looking for might have been removed, had its name changed, or is temporarily unavailable. HTTP 404 - File not found.
356. The page number you entered is invalid Error 2206 The page number you entered is [email protected] example, it may be a negative number or an invalid range, such as 6 to [email protected]@[email protected]@@1.
357. The parent control can't contain the type of control you selected Error 2151 The parent control can't contain the type of control you [email protected] example, you used the CreateControl function to designate an option group as the parent of a text [email protected]@[email protected]@@1.
358. The password is invalid; the message wasn't sent Error 2296 The password is invalid; the message wasn't [email protected]@@[email protected]@@1.
359. The password you entered in the Old Password box is incorrect Error 2620 The password you entered in the Old Password box is [email protected] enter the correct password for this [email protected]@[email protected]@@1.
360. The password you entered is not valid Error 141 A The password you entered is not valid. Please make sure that your Caps Lock and language selector are correctly set.
361. The path C: or the volume is invalid Error 1324 The path C: or the volume is invalid. Please enter it again.
362. The path you entered for the SourceDoc property setting for a linked OLE object is too long Error 2784 The path you entered for the SourceDoc property setting for a linked OLE object is too [email protected] the file to a location with a shorter [email protected]@[email protected]@[email protected]
363. The pattern string is invalid Error 7762 The pattern string is [email protected]@@[email protected]@[email protected]
364. The primary key has been changed Error 2398 The primary key has been [email protected] table is the primary table in one or more relationships. Changes to the primary key won't be [email protected]@[email protected]@@1.
365. The procedure '|' already exists Error 29005 The procedure '|' already [email protected] another procedure [email protected]@[email protected]@@1.
366. The process failed because there is no printer installed Error 7796 The process failed because there is no printer [email protected] Microsoft Office Access saves the printer settings with each form or report, a printer is needed to convert, enable, copy and paste, import, or export your forms or reports. To install a pr
367. The profile '|' that you specified on the command line doesn't exist in the Windows Registry Error 7860 The profile '|' that you specified on the command line doesn't exist in the Windows [email protected]@@[email protected]@@1.
368. The program firefox.exe version 17 Error 1002 The program firefox.exe version 17.0.1.4715 stopped interacting with Windows and was closed. To see if more information about the problem is available, check the problem history in the Action Center control panel.
369. The project cannot be converted to this format Error 32532 The project cannot be converted to this format. The project can only be converted to Access 2000 or newer format.
370. The query cannot be completed Error 3183 The query cannot be completed. Either the size of the query result is larger than the maximum size of a database (2 GB), or there is not enough temporary storage space on the disk to store the query result.
371. The record source '|' specified on this form or report does not exist Error 2580 The record source '|' specified on this form or report does not exist. @The name of the recordsource may be misspelled, the recordsource was deleted or renamed, or the recordsource exists in a different [email protected] the Form or Report's Design view, displ
372. The remote data isn't accessible Error 8525 The remote data isn't [email protected] tried to open a form or report that includes a DDE or DDESend function in a calculated control that specifies an OLE server application.Do you want to start the application |[email protected]@[email protected]@@2.
373. The remote server machine does not exist or is unavailable Error 462 The CreateObject function requires a valid server.
374. The repair operation was cancelled Error 32520 The repair operation was cancelled. To repair the file manually, on the File menu, point to Manage Database, and then click Compact and Repair Database.
375. The report is still more than one page wide Error 8100 The report is still more than one page [email protected] fit the report on one page decrease the report width or increase the page [email protected] can decrease the report width by selecting each control that is farthest to the right, moving it to the left, and removing
376. The report is still more than one page wide Error 8101 The report is still more than one page [email protected] fit the report on one page decrease the report width or increase the page [email protected] can decrease the report width by selecting each control that is farthest to the left, moving it to the right, and removing
377. The Requery action can't be used on the control '| Error 2119 The Requery action can't be used on the control '|.'@Certain controls, such as labels and rectangles, can't receive the focus; therefore, you can't apply a Requery action to [email protected]@[email protected]@[email protected]
378. The Requery action cannot be used on a control bound to a Recordset Error 6025 The Requery action cannot be used on a control bound to a [email protected]@@[email protected]@@1.
379. The request is not yet implemented Error 47 Error 47: Comodo Cloud Drive has encountered a problem and needs to close. We are sorry for the inconvenience.
380. The required element is missing under and for a fixed width format Error 31604 The required element is missing under and for a fixed width [email protected]@@[email protected]@@1.
381. The row has been deleted since the update was started Error 542 A record cant be updated because it was previously deleted.
382. The row height exceeds the space between the top and bottom margins Error 10253 The row height exceeds the space between the top and bottom [email protected] you want to print the columns with incomplete [email protected] prevent data from being cut off, try one or more of the following: * Increase the column width and decrease the row height.* Cha
383. The RowSourceType property must be set to 'Table/Query' to use this method Error 6026 The RowSourceType property must be set to 'Table/Query' to use this [email protected]@@[email protected]@@1.
384. The RowSourceType property must be set to 'Value List' to use this method Error 6014 The RowSourceType property must be set to 'Value List' to use this [email protected]@@[email protected]@@1.
385. The Save As command can't process any subforms contained in your report Error 9517 The Save As command can't process any subforms contained in your [email protected] you want to proceed [email protected]@[email protected]@@2.
386. The Save operation failed Error 29028 The Save operation [email protected]@@[email protected]@@1.
387. The schema for this table has changed Error 3851 The schema for this table has changed. You must refresh the table before editing or adding new records.
388. The section name you entered doesn't follow Microsoft Office Access object-naming rules Error 2195 The section name you entered doesn't follow Microsoft Office Access object-naming [email protected]@@[email protected]@[email protected]
389. The section number you entered is invalid Error 2462 The section number you entered is [email protected]@@[email protected]@@1.
390. The selected item is customized and doesn't have context-sensitive Help Error 2068 The selected item is customized and doesn't have context-sensitive [email protected] more information on creating custom Help for a form, report, or control, click [email protected]@[email protected]@[email protected]
391. The selected transform file '|' cannot be found Error 31501 The selected transform file '|' cannot be found. Please select a different transform.
392. The selected transform file cannot be found Error 31506 The selected transform file cannot be found. Select a different transform or remove the transform. Then try to export again.
393. The SelectObject method can't be used on a report that is currently printing Error 2530 The SelectObject method can't be used on a report that is currently [email protected]@@[email protected]@@1.
394. The SendKeys action requires the Microsoft Office Access Utility Add-in to be loaded Error 2526 The SendKeys action requires the Microsoft Office Access Utility Add-in to be [email protected] Microsoft Office Access or Microsoft Office Setup to reinstall Microsoft Office Access and the Microsoft Office Access Utility [email protected]@[email protected]@[email protected]
395. The server cannot find the user requested Error 0x8100030A The server cannot find the user requested. This may be because the user does not exist, that the username is invalid, or adding a user has failed server side. IMAP_AUTH_NOT_POSSIBLE.
396. The server could not be found. SOCKET_CONNECT_ERROR Error 0x800CCC0D The server could not be found. (Account: account name, POPserver: 'mail', Error Number: 0x800ccc0d). SOCKET_CONNECT_ERROR.
397. The server name you entered can not be found on the network (it might be down temporarily) Error 0x80040900 Task 'pop.isot.com - Receiving' reported error (0x80040900) : 'The server name you entered can not be found on the network (it might be down temporarily). Please verify that you are online and that the server name is correct.'. Incorrect account settings.
398. The server you are trying to access is case sensitive Error 30008 The server you are trying to access is case sensitive. Objects of the same name but of different case are not supported. Using these objects may result in a loss of data.
399. The server's MSysConf table exists, but is in an incorrect format Error 3407 The server's MSysConf table exists, but is in an incorrect format. Contact your system administrator.
400. The SetMenuItem action does not have enough information to be carried out Error 7869 The SetMenuItem action does not have enough information to be carried [email protected] argument is invalid, or there are not enough [email protected]@[email protected]@@1.
401. The SetProperty action or method failed because there was no form or report context Error 32602 The SetProperty action or method failed because there was no form or report [email protected] establish the correct context for SetProperty, call OpenForm or OpenReport before calling SetProperty, or call SetProperty from an event on a form or [email protected]@[email protected]@@1.
402. The setting for the ColumnCount property must be from 1 through 255 Error 2126 The setting for the ColumnCount property must be from 1 through [email protected]@@[email protected]@[email protected]
403. The setting for the DecimalPlaces property must be from 0 through 15, or 255 for Auto (default) Error 2132 The setting for the DecimalPlaces property must be from 0 through 15, or 255 for Auto (default)[email protected]@@[email protected]@@1.
404. The setting for the FieldSize property must be from 0 through 255 Error 2373 The setting for the FieldSize property must be from 0 through [email protected]@@[email protected]@@1.
405. The setting for the FieldSize property must be from 1 through 8000 Error 2399 The setting for the FieldSize property must be from 1 through [email protected]@@[email protected]@@1.
406. The setting for the FontSize property must be from 1 through 127 Error 2125 The setting for the FontSize property must be from 1 through [email protected]@@[email protected]@[email protected]
407. The setting for the ListRows property must be from 1 through 255 Error 2144 The setting for the ListRows property must be from 1 through [email protected]@@[email protected]@[email protected]
408. The setting for the Precision property must be from 1 through 28 Error 6003 The setting for the Precision property must be from 1 through [email protected]@@[email protected]@@1.
409. The setting for the Range argument can't be longer than 255 characters Error 2509 The setting for the Range argument can't be longer than 255 [email protected]@@[email protected]@[email protected]
410. The setting for the Scale property must be from 0 through 28 Error 6004 The setting for the Scale property must be from 0 through [email protected]@@[email protected]@@1.
411. The setting for the Update Retry Interval must be from 0 through 1,000 milliseconds Error 2272 The setting for the Update Retry Interval must be from 0 through 1,000 [email protected]@@[email protected]@@1.
412. The setting for this property is too long Error 2176 The setting for this property is too [email protected] can enter up to either 255 or 2,048 characters for this property, depending on the data [email protected]@[email protected]@@1.
413. The setting for this property is too long Error 31003 The setting for this property is too [email protected] can enter up to either 255 or 2,048 characters for this property, depending on the data [email protected]@[email protected]@@1.
414. The setting for Update Retries must be from 0 through 10 Error 2273 The setting for Update Retries must be from 0 through [email protected]@@[email protected]@@1.
415. The setting you entered is invalid Error 8403 The setting you entered is [email protected] database's sort order cannot be updated.The setting you entered for the New database sort order option (Personalize category) of the Access Options dialog box (click the Microsoft Office Button and then click Access
416. The setting you entered isn't valid for this property Error 2101 The setting you entered isn't valid for this [email protected] see the valid settings for this property, search the Help index for the name of the [email protected]@[email protected]@@1.
417. The settings for the GridX and GridY properties must be from 1 through 64 Error 2130 The settings for the GridX and GridY properties must be from 1 through [email protected]@@[email protected]@@1.
418. The Setup Routines For The Microsoft Excel Driver Error Code 126 Error 126 Error 126: Microsoft Excel has encountered a problem and needs to close. We are sorry for the inconvenience.
419. The shortcut '|' must be re-created Error 2312 The shortcut '|' must be [email protected] file may be missing, damaged, or in an older format that can't be [email protected]@[email protected]@@1.
420. The Sims 2 Error Code 12 Error 12 Error 12: The Sims has encountered a problem and needs to close. We are sorry for the inconvenience.
421. The Sims 3 Error 0X0175Dcbb Fix Error 0x0175DCBB Error 0x0175DCBB: The Sims has encountered a problem and needs to close. We are sorry for the inconvenience.
422. The Sims 3 Error 0X065D0274 Error 0x065D0274 Error 0x065D0274: The Sims has encountered a problem and needs to close. We are sorry for the inconvenience.
423. The Sims 3 Error 0X8000Ffff Error 0x8000FFFF Error 0x8000FFFF: The Sims has encountered a problem and needs to close. We are sorry for the inconvenience.
424. The Sims 3 Error 16 Error 16 Error 16: The Sims has encountered a problem and needs to close. We are sorry for the inconvenience.
425. The Sims 3 Error 403 Error 403 Error 403: The Sims has encountered a problem and needs to close. We are sorry for the inconvenience.
426. The Sims 3 Error 404 Error 404 Error 404: The Sims has encountered a problem and needs to close. We are sorry for the inconvenience.
427. The Sims 3 Error 5001 Error 5001 Error 5001: The Sims has encountered a problem and needs to close. We are sorry for the inconvenience.
428. The Sims 3 Error 5005 Error 5005 Error 5005: The Sims has encountered a problem and needs to close. We are sorry for the inconvenience.
429. The Sims 3 Error 5006 Error 5006 Error 5006: The Sims has encountered a problem and needs to close. We are sorry for the inconvenience.
430. The Sims 3 Error 6000 Error 6000 Error 6000: The Sims has encountered a problem and needs to close. We are sorry for the inconvenience.
431. The Sims 3 Error Code 0X024E424F Error 0x024E424F Error 0x024E424F: The Sims has encountered a problem and needs to close. We are sorry for the inconvenience.
432. The Sims 3 Error Code 0X039E8474 Error 0x039E8474 Error 0x039E8474: The Sims has encountered a problem and needs to close. We are sorry for the inconvenience.
433. The Sims 3 Error Code 13 Error 13 Error 13: The Sims has encountered a problem and needs to close. We are sorry for the inconvenience.
434. The Sims 3 Error Code 15 Error 15 Error 15: The Sims has encountered a problem and needs to close. We are sorry for the inconvenience.
435. The Sims 3 Error Code 2 Error 2 Error 2: The Sims has encountered a problem and needs to close. We are sorry for the inconvenience.
436. The Sims 3 Error Code 3 Error 3 Error 3: The Sims has encountered a problem and needs to close. We are sorry for the inconvenience.
437. The Sims 3 Error Code 6 Error 6 Error 6: The Sims has encountered a problem and needs to close. We are sorry for the inconvenience.
438. The Sims Error 500 Error 500 Error 500: The Sims has encountered a problem and needs to close. We are sorry for the inconvenience.
439. The Sims Error Code 12 Fix Error 12 Error 12: The Sims has encountered a problem and needs to close. We are sorry for the inconvenience.
440. The Sims Error Code 17 Error 17 Error 17: The Sims has encountered a problem and needs to close. We are sorry for the inconvenience.
441. The Sims Medieval Error Code 24576 Error 24576 Error 24576: The Sims has encountered a problem and needs to close. We are sorry for the inconvenience.
442. The site you specified does not contain any lists Error 31562 The site you specified does not contain any lists. Verify the address of the site, or contact your site administrator.
443. The site you specified does not support importing data from a Microsoft Office Access database Error 31586 The site you specified does not support importing data from a Microsoft Office Access database. The site must be running Windows SharePoint Services from Microsoft.
444. The site you specified does not support importing data to a Microsoft Office Access database Error 31561 The site you specified does not support importing data to a Microsoft Office Access database. The site must be running Microsoft Windows SharePoint Services.
445. The site you specified does not support linking to a Microsoft Office Access database Error 31560 The site you specified does not support linking to a Microsoft Office Access database. The site must be running Windows SharePoint Services from Microsoft.
446. The Smart Tag property value cannot exceed 1024 characters Error 31553 The Smart Tag property value cannot exceed 1024 [email protected]@@[email protected]@@1.
447. The source application is not responding Error 8063 The source application is not responding. Do you want to continue [email protected] DDE channel has been established, but the data exchange was not completed in the amount of time specified in the OLE/DDE Timeout setting in the Access Options dialog box (click
448. The source or destination database name is missing Error 7823 The source or destination database name is missing. The transfer operation can't [email protected]@@[email protected]@@1.
449. The source or destination server name is missing Error 7824 The source or destination server name is missing. The transfer operation can't [email protected]@@[email protected]@@1.
450. The Source value you have specified is not valid Error 32587 The Source value you have specified is not [email protected]@@[email protected]@@1.
451. The specification does not contain a description Error 31601 The specification does not contain a description. '|'[email protected]@@[email protected]@@1.
452. The specification failed to execute Error 31612 The specification failed to execute. Try re-creating the specification.
453. The specification with the specified index does not exist Error 31602 The specification with the specified index does not exist. Specify a different index. '|'[email protected]@@[email protected]@@1.
454. The specification XML failed to validate against the schema Error 31597 The specification XML failed to validate against the schema. There is an error in the following line of the XML document: |[email protected]@@[email protected]@@1.
455. The specification XML failed to validate against the schema Error 31598 The specification XML failed to validate against the schema. There is an error in the following specification XML string: |1 Possible value could be one of following '|2'[email protected]@@[email protected]@@1.
456. The specified command (OutputTo) is not available now Error 32536 The specified command (OutputTo) is not available now. Close objects open in Design View or Layout View and try [email protected]@@[email protected]@@1.
457. The specified description '|' is too long Error 31600 The specified description '|' is too long. The description cannot exceed 255 [email protected]@@[email protected]@@1.
458. The specified file name could not be used to create a database Error 32582 The specified file name could not be used to create a database. Specify a different database name.
459. The specified name '|' cannot be set due to one of the following reasons: Error 31599 The specified name '|' cannot be set due to one of the following reasons: .
460. The specified object can't be used as an owner form for Show() Error 371 You specified an invalid object for the OwnerForm parameter of the Show method.
461. The specified path is invalid Error 2630 The specified path is [email protected]@@[email protected]@@1.
462. The specified path is too long Error 2631 The specified path is too [email protected]@@[email protected]@@1.
463. The specified record source contains duplicate names for some output fields Error 30015 The specified record source contains duplicate names for some output fields. Use aliases in your SELECT statement to give each field a unique name.
464. The specified template cannot be created in the specified file format Error 32562 The specified template cannot be created in the specified file format. Specify a different file format for the new database.
465. The specified transform did not successfully convert the data Error 31503 The specified transform did not successfully convert the data. Select a different transform.
466. The specified transform did not successfully convert the data Error 31555 The specified transform did not successfully convert the data.Would you like to save a copy of the Data to Export at '|' for troubleshooting?.
467. The specified word is too large Error 9521 The specified word is too [email protected] can't exceed 64 [email protected]@[email protected]@@1.
468. The speech engine returned the following error: 164 Error 164 The speech engine returned the following error: 164. The Dragon profile you are trying to use is corrupted and no longer useable.
469. The spelling check is complete Error 9536 The spelling check is [email protected]@@[email protected]@@1.
470. The spelling checker can't undo your last change Error 9541 The spelling checker can't undo your last [email protected] data in field '|' has been modified by another user. To resume the spelling check, click [email protected]@[email protected]@@1.
471. The spelling checker only works on text fields that contain text data Error 9526 The spelling checker only works on text fields that contain text [email protected]'re trying to check a field with a data type other than Text or [email protected]@[email protected]@@1.
472. The SQL script used to create database object '|' is corrupted Error 7830 The SQL script used to create database object '|' is corrupted. Microsoft Office Access can't create the new [email protected]@@[email protected]@@1.
473. The SQL script used to create database objects is corrupted Error 7829 The SQL script used to create database objects is corrupted. Microsoft Office Access can't create the new [email protected]@@[email protected]@@1.
474. The SQL statement could not be executed because it contains ambiguous outer joins Error 3258 The SQL statement could not be executed because it contains ambiguous outer joins. To force one of the joins to be performed first, create a separate query that performs the first join and then include that query in your SQL statement.
475. The startup action associated with this file may not be safe Error 31542 The startup action associated with this file may not be safe. Do you want to execute the startup action as you open the [email protected]@@[email protected]@@1.
476. The startup action associated with this file may not be safe Error 31543 The startup action associated with this file may not be safe. If you choose not to execute the startup action, Microsoft Office Access will not open the file. Do you want to execute the startup action and open the [email protected]@@[email protected]@@1.
477. The string returned by the builder was too long Error 2275 The string returned by the builder was too [email protected] result will be [email protected]@[email protected]@@1.
478. The supplied DisplayObject must be a child of the caller Error 2025 The supplied DisplayObject must be a child of the caller. The application or component may be attempting to remove a DisplayObject or component but it cannot be located. All display objects such as MovieClip and Sprite inherit from the DisplayObject class
479. The synchronization was completed successfully Error 7730 The synchronization was completed [email protected]@@[email protected]@@1.
480. The Synchronizer or Replication Manager found unread data in the shared memory Error 3529 The Synchronizer or Replication Manager found unread data in the shared memory. The existing data will be overwritten.
481. The syntax of the subquery in this expression is incorrect Error 7956 The syntax of the subquery in this expression is [email protected] the subquery's syntax and enclose the subquery in [email protected]@[email protected]@[email protected]
482. The system cannot open the device or file specified Error 110 110. The system cannot open the device or file specified.
483. The system cannot open the device or file specified Error 2755 The system cannot open the device or file specified. Installation fails with exit code 2755 when installing ESET Remote Administrator 3.x to Windows Server 2000/2003/2008.
484. The table '|' already exists Error 7875 The table '|' already [email protected] created or renamed a table, and then tried to save it. Before Microsoft Office Access could save the table, another user created or renamed one using the same [email protected]@[email protected]@@1.
485. The table could not be exported because you do not have sufficient permissions Error 31579 The table could not be exported because you do not have sufficient permissions. Please contact your site administrator.
486. The table name you entered doesn't follow Microsoft Office Access object-naming rules Error 7871 The table name you entered doesn't follow Microsoft Office Access object-naming [email protected] more information about naming objects, click [email protected]@[email protected]@[email protected]
487. The table or query you are exporting contains more than one attachment column Error 7925 The table or query you are exporting contains more than one attachment column. Microsoft Windows SharePoint Services only supports one attachment column. Remove all but one attachment column, and then retry exporting the table or query.
488. The table which you are trying to append to is currently open and must be closed before proceeding Error 32588 The table which you are trying to append to is currently open and must be closed before proceeding. Do you want to save the changes and close the [email protected]@@[email protected]@@2.
489. The TEMP environment variable isn't defined Error 7821 The TEMP environment variable isn't defined. Microsoft Office Access can't find the temporary file [email protected]@@[email protected]@@1.
490. The text file specification '|' does not exist Error 3625 The text file specification '|' does not exist. You cannot import, export, or link using the specification.
491. The Text Format property of the bound field '|' is not currently Plain Text Error 9551 The Text Format property of the bound field '|' is not currently Plain Text. You should change the Text Format property of the table field before you change the property of this control. If you change the Text Format property of this control to Plain Text
492. The Text Format property of the bound field '|' is not currently Rich Text Error 9550 The Text Format property of the bound field '|' is not currently Rich Text. You should change the Text Format property of the table field before you change the property of this control. If you change the Text Format property of this control to Rich Text b
493. The text is too long to be edited Error 2221 The text is too long to be [email protected]@@[email protected]@@1.
494. The text or expression you entered doesn't match the type of data you are searching for Error 2161 The text or expression you entered doesn't match the type of data you are searching [email protected] the text or expression, or search in a different [email protected]@[email protected]@@1.
495. The text you entered isn't an item in the list Error 2237 The text you entered isn't an item in the [email protected] an item from the list, or enter text that matches one of the listed [email protected]@[email protected]@@1.
496. The text you entered isn't an item in the list Error 32504 The text you entered isn't an item in the [email protected] you want to edit the items in the [email protected]@[email protected]@@4.
497. The toolbar '|' is partly unreadable Error 8060 The toolbar '|' is partly [email protected] Microsoft Office Access can't display all the toolbar buttons. The specified toolbar may be in a different format than the toolbars in the current version of Microsoft Office [email protected] OK to close the dialog box,
498. The Toolbar argument can't be longer than 64 characters Error 2529 The Toolbar argument can't be longer than 64 [email protected]@@[email protected]@@1.
499. The toolbar name '|' you entered already exists Error 7851 The toolbar name '|' you entered already [email protected] a unique name for this [email protected]@[email protected]@@1.
500. The toolbar name '|' you entered doesn't follow Microsoft Office Access object-naming rules Error 7852 The toolbar name '|' you entered doesn't follow Microsoft Office Access object-naming [email protected] more information about naming objects, click [email protected]@[email protected]@[email protected]
501. The toolbar or menu | already exists Error 2080 The toolbar or menu | already [email protected] you want to replace the existing toolbar or [email protected]@[email protected]@@2.
502. The Track name AutoCorrect info option generates name maps for the objects in the database Error 31558 The Track name AutoCorrect info option generates name maps for the objects in the database. This may take several [email protected] you want to leave this option turned [email protected]@[email protected]@@1.
503. The Transfer Database Wizard didn't provide enough information to perform the transfer operation Error 7834 The Transfer Database Wizard didn't provide enough information to perform the transfer [email protected]@@[email protected]@@1.
504. The transfer operation has been cancelled Error 7848 The transfer operation has been cancelled. The destination database '|' was created and is in an unknown state. What would you like to do with the destination database?&Keep[email protected]@@[email protected]@@.
505. The UpdateDependencyInfo method could not update one or more objects Error 31666 The UpdateDependencyInfo method could not update one or more objects. Microsoft Office Access has created a Name AutoCorrect Save Failures table in the current database with more information about the failing [email protected]@@[email protected]@[email protected]
506. The value cannot be added to this new row until the row has been committed Error 3822 The value cannot be added to this new row until the row has been committed. Commit the row first, and then try adding the value.
507. The value of an (AutoNumber) field cannot be retrived prior to being saved Error 31004 The value of an (AutoNumber) field cannot be retrived prior to being saved.Please save the record that contains the (AutoNumber) field prior to performing this [email protected]@@[email protected]@@1.
508. The value specified for the Type parameter is invalid Error 32519 The value specified for the Type parameter is invalid. Specify one of the following: Report, Form, Query, or Table.
509. The value violates the validation rule for the field or record Error 2116 The value violates the validation rule for the field or [email protected] example, you might have changed a validation rule without verifying whether the existing data matches the new validation [email protected] Undo to restore the previous value, or enter a new val
510. The value you entered does not meet the validation rule defined for the field or control Error 2107 The value you entered does not meet the validation rule defined for the field or [email protected] see the validation rule, switch to Design view, click the appropriate field, and then, if the property sheet is not open, press F4. Then, click the Data tab in th
511. The value you entered doesn't match the type required Error 7953 The value you entered doesn't match the type [email protected]* The variable, property, or object may not be of the correct type.* You may have used an If TypeOf construct with something other than a [email protected]@[email protected]@@1.
512. The value you entered exceeds the Alias property's 64-character limit Error 2343 The value you entered exceeds the Alias property's 64-character [email protected]@@[email protected]@[email protected]
513. The value you entered for the interval, number, or date argument in the function is invalid Error 2468 The value you entered for the interval, number, or date argument in the function is [email protected] the argument to make sure that you entered it correctly.For more information on valid argument values, search the Help index for 'DatePart function,' 'DateA
514. The value you entered for the show argument is invalid Error 2523 The value you entered for the show argument is [email protected] used the ShowToolbar [email protected] values for this argument are acToolbarYes, acToolbarWhereApprop, and acToolbarNo, or the corresponding numeric values 0, 1, and [email protected]@[email protected]@1.
515. The value you entered is the wrong data type for this field Error 7880 The value you entered is the wrong data type for this [email protected] an [email protected]@[email protected]@@1.
516. The value you entered isn't appropriate for the input mask '|' specified for this field Error 2279 The value you entered isn't appropriate for the input mask '|' specified for this [email protected]@@[email protected]@[email protected]
517. The value you entered isn't valid for the field '|' Error 32502 The value you entered isn't valid for the field '|'[email protected] example, you may have entered text in a numeric field or a number that is greater than the FieldSize setting [email protected]@[email protected]@@1.
518. The value you entered isn't valid for this field Error 2113 The value you entered isn't valid for this [email protected] example, you may have entered text in a numeric field or a number that is larger than the FieldSize setting [email protected]@[email protected]@@1.
519. The value you entered isn't valid for this field Error 6032 The value you entered isn't valid for this [email protected] example, you may have entered a null [email protected]@[email protected]@@1.
520. The value you used for the TabIndex property isn't valid Error 2184 The value you used for the TabIndex property isn't valid. The correct values are from 0 through |[email protected]@@[email protected]@[email protected]
521. The values for 'File or web page name' and/or 'Text to Display' are too long Error 7981 The values for 'File or web page name' and/or 'Text to Display' are too [email protected] values will be truncated. To keep your original values, click Cancel in the Edit Hyperlink [email protected]@[email protected]@@1.
522. The Var and VarP aggregate functions are not supported in an Access project Error 2590 The Var and VarP aggregate functions are not supported in an Access [email protected]@@[email protected]@@1.
523. The VBA file (VBAJET.dll for 16-bit versions, or VBAJET32 Error 3446 The VBA file (VBAJET.dll for 16-bit versions, or VBAJET32.dll for 32-bit versions) is missing. Try reinstalling the application that returned the error.
524. The VBA file (VBAJET.dll for 16-bit versions, or VBAJET32 Error 3447 The VBA file (VBAJET.dll for 16-bit versions, or VBAJET32.dll for 32-bit versions) failed to initialize when called. Try reinstalling the application that returned the error.
525. The VBA modules in this database appear to have been saved with errors Error 29080 The VBA modules in this database appear to have been saved with errors. Access can recover the modules, but you should backup the database first. To cancel so you can make a backup copy of the database, click Cancel. Then make a backup copy of the databas
526. The version of Access used to save this database cannot be detected Error 29082 The version of Access used to save this database cannot be detected. This problem cannot be corrected because the database is read-only. Click OK, and after the database closes, make a backup copy of the database. Then open the database with read/write pe
527. The version of AceRecr.DLL that was loaded was too old Error 3796 The version of AceRecr.DLL that was loaded was too old. Run setup again to get the correct version of this file.
528. The website cannot display the page (HTTP 405) Error 405 The website cannot display the page (HTTP 405). Internet Explorer is able to connect to the website, but the webpage content can't be downloaded to your computer. This is usually caused by a problem in the way the webpage was programmed.
529. The website is too busy to show the webpage (HTTP 408) Error 408 The website is too busy to show the webpage (HTTP 408). The server took too long to display the webpage or there were too many people requesting the same page. Try again later.
530. The website is too busy to show the webpage (HTTP 409) Error 409 The website is too busy to show the webpage (HTTP 409). The server took too long to display the webpage or there were too many people requesting the same page. Try again later.
531. The website is unable to display the webpage (HTTP 501) Error 501 The website is unable to display the webpage (HTTP 501). Not Implemented) means that the website you're visiting isn't set up to display the content your browser is requesting. For example, the browser is asking for a file with a video extension (.AVI), b
532. The website is unable to display the webpage (HTTP 505) Error 505 The website is unable to display the webpage (HTTP 505). Version Not Supported) means the website doesn't support the version of the HTTP protocol your browser uses to request the webpage (HTTP/1.1 being the most common).
533. The Width attribute is required for all elements under or for a fixed width format Error 31605 The Width attribute is required for all elements under or for a fixed width [email protected]@@[email protected]@@1.
534. The wizard you've requested is not installed or is in a bad state Error 7850 The wizard you've requested is not installed or is in a bad state. Please install or reinstall the wizard. If you do not have permission to do this on your computer, please contact your help desk [email protected]@@[email protected]@[email protected]
535. The XML schema properties do not match the existing table structures Error 31536 The XML schema properties do not match the existing table [email protected] existing [email protected]@[email protected]@@1.
536. The | action was canceled Error 2501 The | action was [email protected] used a method of the DoCmd object to carry out an action in Visual Basic, but then clicked Cancel in a dialog box.For example, you used the Close method to close a changed form, then clicked Cancel in the dialog box that ask
537. The | object doesn't support the attempted operation Error 2723 The | object doesn't support the attempted [email protected] OLE object was changed to a picture, or the link to the object was [email protected] you want to perform the operation, delete the OLE object, and then embed or link it [email protected]@[email protected]@1.
538. The | object doesn't support verbs that can be performed on an OLE object, such as play or edit Error 2714 The | object doesn't support verbs that can be performed on an OLE object, such as play or [email protected] the OLE server's documentation for information on the verbs the OLE object supports, or use the ObjectVerbs property or the ObjectVerbsCount property to
539. The | object has no information that can be displayed Error 2717 The | object has no information that can be [email protected] tried to perform an operation on a bound or unbound object frame containing an OLE object, but the OLE object is [email protected] the frame, click Insert Object, and then use the dialog box to l
540. The | object is stored in a format that is incompatible with the version of OLE on your computer Error 2743 The | object is stored in a format that is incompatible with the version of OLE on your [email protected]@@[email protected]@@1.
541. The | object isn't a linked object Error 2788 The | object isn't a linked [email protected] property you tried to set in Visual Basic applies only to linked [email protected]@[email protected]@@1.
542. The | object isn't registered Error 2702 The | object isn't [email protected] object may be calling an application that isn't [email protected] register the application, reinstall [email protected]@@@1.
543. The | object you tried to create or edit is too large to save Error 2698 The | object you tried to create or edit is too large to [email protected]* Your database may not contain enough space for the object.* Your computer may be out of disk space.For information on freeing disk space, search the Microsoft Windows Help index for 'disk sp
544. The | object you tried to edit doesn't have any displayable information Error 2704 The | object you tried to edit doesn't have any displayable [email protected]@@[email protected]@[email protected]
545. The | type isn't an installed database type or doesn't support the operation you chose Error 2507 The | type isn't an installed database type or doesn't support the operation you [email protected] used the TransferDatabase method, but an expression in the databasetype argument doesn't evaluate to a valid database type for importing, exporting, or linking.For
546. The |0 '|1' could not be read from the template file Error 32565 The |0 '|1' could not be read from the template file. The object may be in an unrecognized format or contain invalid data.
547. The |0 '|1' in the template could not be loaded from text because of a parsing error Error 32567 The |0 '|1' in the template could not be loaded from text because of a parsing error. |2.
548. There are calls to 16-bit dynamic-link libraries (.dll) in modules in this database Error 29023 There are calls to 16-bit dynamic-link libraries (.dll) in modules in this [email protected] won't work under Microsoft Windows 95 or Microsoft Windows [email protected] your code to call equivalent 32-bit dynamic-link libraries (.dll)[email protected]@[email protected]@1.
549. There are calls to 16-bit dynamic-link libraries (.dll) in modules in this database Error 29025 There are calls to 16-bit dynamic-link libraries (.dll) in modules in this [email protected] won't work under Microsoft Windows 95 or Microsoft Windows [email protected] these calls to equivalent 32-bit dynamic-link [email protected]@[email protected]@.
550. There are currently no printers installed on your computer Error 2202 "There are currently no printers installed on your computer. To use this feature, you must first install a printer in [email protected] more information about how to install a printer, search for ""install printer"" in Windows [email protected]@[email protected]@@1."
551. There are insufficient funds in your account Error 204 There are insufficient funds in your account. Please use a different credit card. (Code 204).
552. There are no MAPI clients installed on this machine Error 3804 There are no MAPI clients installed on this machine. Install a MAPI client (like Outlook) on this machine.
553. There are no registered wizards of this type Error 2015 There are no registered wizards of this [email protected] Microsoft Office Access or Microsoft Office Setup to reinstall the wizards. If you want to preserve your security or custom settings, back up the Microsoft Office Access workgroup information file.For mo
554. There are no synchronization conflicts to resolve Error 7703 There are no synchronization conflicts to [email protected]@@[email protected]@@1.
555. There are not enough system resources to output the data Error 2301 There are not enough system resources to output the [email protected] one or more Microsoft Office Access windows and close other applications. Then try to output the data [email protected]@[email protected]@@1.
556. There are several tables with that name Error 3298 There are several tables with that name. Please specify owner in the format 'owner.table'.
557. There are too many controls on the form to allow Filter By Form Error 7775 There are too many controls on the form to allow Filter By [email protected]@@[email protected]@@1.
558. There are too many message attachments; the message was not sent Error 2291 There are too many message attachments; the message was not [email protected]@@[email protected]@@1.
559. There is a minor error Error 3213 There is a minor error. Click OK to continue.
560. There is a minor error Error 3217 There is a minor error. Click OK to continue.
561. There is a problem with Adobe/Reader Error 1014:1014 There is a problem with Adobe/Reader. If it is running, please exit and try again. (1014: 1014). Acrobat won't read online pdf links.
562. There is a problem with this Windows Installer package Error 1722 Adobe Flash Player 11 ActiveX -- Error 1722.There is a problem with this Windows Installer package. A program run as part of the setup did not finish as expected. Contact your support personnel or package vendor. Action NewCustomAction1, location: C: \Use
563. There is a problem with this Windows Installer package Error 1723 There is a problem with this Windows Installer package. A DLL required for this install to complete could not be run. Contact your support personnel or package vendor.
564. There is a with this protectedpdf document Error 013 There is a with this protectedpdf document. It may be damaged or has been tampered with. Please contact the publisher for a clean file. An incompatible version of FOXIT.
565. There is a(n) '|' in the form control's ValidationRule property Error 2470 There is a(n) '|' in the form control's ValidationRule [email protected] help you create expressions as arguments in Visual Basic, use the Expression Builder. For more information, search the Help index for 'Expression Builder'[email protected]@[email protected]@[email protected]
566. There is already a shortcut named '|1' to the '|2' object in this group Error 31621 There is already a shortcut named '|1' to the '|2' object in this [email protected]@@[email protected]@@1.
567. There is already an existing database with the name you entered Error 7865 There is already an existing database with the name you entered. Give the new database a unique name.
568. There is already an object named '|' in the database Error 31537 There is already an object named '|' in the [email protected]@@[email protected]@@1.
569. There is an invalid add-in entry for '| Error 2309 There is an invalid add-in entry for '|.'@There is an error in the Windows Registry for this add-in. Correct the setting and restart Microsoft Office Access. For information on the Registry, click [email protected]@[email protected]@[email protected]
570. There is an invalid method in an expression Error 2449 There is an invalid method in an [email protected] example, you may have tried to use the Print method with an object other than Report or [email protected]@[email protected]@[email protected]
571. There is an invalid use of the Error 2447 There is an invalid use of the. (dot) or ! operator or invalid [email protected] may have entered an invalid identifier or typed parentheses following the Null [email protected]@[email protected]@[email protected]
572. There is no active datasheet Error 2484 There is no active [email protected]@@[email protected]@@1.
573. There is no current code context object Error 7955 There is no current code context [email protected]@@[email protected]@@1.
574. There is no field named '|' in the current record Error 2109 There is no field named '|' in the current [email protected]@@[email protected]@@1.
575. There is no object in this control Error 2683 There is no object in this [email protected]@@[email protected]@@1.
576. There is no primary key defined Error 10005 There is no primary key [email protected] a primary key isn't required, it's highly recommended. A table must have a primary key for you to define a relationship between this table and other tables in the database.Do you want to create a primary key [email protected]
577. There is no primary key defined Error 10030 There is no primary key [email protected] a primary key isn't required, it's highly recommended. A table must have a primary key for you to define relationships between this table and other tables in the database.Do you want to return to table design and
578. There is no sorting or grouping field or expression defined for the group level number you used Error 2464 There is no sorting or grouping field or expression defined for the group level number you [email protected] valid group level number can be from 0 (for the first field or expression you sort or group on) through 9 (for the tenth). Count the group levels in the rep
579. There is no stored hyperlink in this control Error 7976 There is no stored hyperlink in this [email protected]@@[email protected]@@1.
580. There is not enough disk space to create a temporary buffer file for printing Error 2267 There is not enough disk space to create a temporary buffer file for [email protected] up some disk space to make room for the temporary buffer [email protected]@[email protected]@@1.
581. There isn't enough disk space or memory to undo the data changes this action query is about to make Error 10519 There isn't enough disk space or memory to undo the data changes this action query is about to [email protected] you want to run this action query anyway?For information on freeing disk space or freeing memory, search the Microsoft Windows Help index for 'disk spa
582. There isn't enough free memory to continue the Search operation Error 2175 There isn't enough free memory to continue the Search [email protected] unneeded programs. Then try the Search operation again.For more information on freeing memory, search the Microsoft Windows Help index for 'memory, troubleshooting'[email protected]@[email protected]@@3.
583. There isn't enough free memory to open the file '| Error 2048 There isn't enough free memory to open the file '|.'@Close unneeded programs and try again.For more information on freeing memory, search the Microsoft Windows Help index for 'memory, troubleshooting'[email protected]@[email protected]@@1.
584. There isn't enough free memory to start Microsoft Office Access Error 2005 There isn't enough free memory to start Microsoft Office [email protected] unneeded programs and try again.For information on freeing memory, search the Microsoft Windows Help index for 'memory, troubleshooting'[email protected]@[email protected]@@3.
585. There isn't enough free memory to update the display Error 2052 There isn't enough free memory to update the display. Close unneeded programs and try again.
586. There isn't enough memory available to perform this calculation Error 2446 There isn't enough memory available to perform this [email protected] unneeded programs, and try again.For more information on freeing memory, search the Microsoft Windows Help index for 'memory, troubleshooting'[email protected]@[email protected]@@1.
587. There isn't enough memory to complete the Automation object operation on the | object Error 2749 There isn't enough memory to complete the Automation object operation on the | [email protected] unneeded programs and try the operation again.For more information on freeing memory, search the Microsoft Windows Help index for 'memory, troubleshooting'[email protected]@[email protected]@@
588. There isn't enough memory to complete the operation Error 2738 There isn't enough memory to complete the [email protected] unneeded programs and try the operation again.For more information on freeing memory, search the Microsoft Windows Help index for 'memory, troubleshooting'[email protected]@[email protected]@@1.
589. There isn't enough memory to create an input area Error 29000 There isn't enough memory to create an input [email protected] unneeded programs. Then try to create the input area again.For more information on freeing memory, search the Microsoft Windows Help index for 'memory, troubleshooting'[email protected]@[email protected]@@1.
590. There isn't enough memory to execute the macro that updates the active filter Error 8507 There isn't enough memory to execute the macro that updates the active [email protected] Office Access is closing the Filter window.Close unneeded programs. Then try again to open the Filter window.For more information on freeing memory, search the Micros
591. There isn't enough memory to perform this operation Error 2004 There isn't enough memory to perform this operation. Close unneeded programs and try the operation again.
592. There isn't enough memory to retrieve data for the list box Error 2170 There isn't enough memory to retrieve data for the list [email protected] unneeded programs. Then close and reopen the active form, and click the list box again.For more information on freeing memory, search the Microsoft Windows Help index for 'memory, troubles
593. There isn't enough memory to run the NotInList event procedure Error 2311 There isn't enough memory to run the NotInList event [email protected]@@[email protected]@@1.
594. There isn't enough stack memory left to perform the operation Error 2057 There isn't enough stack memory left to perform the [email protected] operation is too complicated. Try simplifying the [email protected]@[email protected]@@3.
595. There isn't enough temporary disk space to complete the operation Error 7876 There isn't enough temporary disk space to complete the [email protected] disk space, and then try the operation again.For more information on freeing temporary disk space, search the Microsoft Windows Help index for 'disk space, freeing'.For information on
596. There was a font initialization error Error 2277 There was a font initialization [email protected]@@[email protected]@@1.
597. There was a problem accessing a property or method of the OLE object Error 2757 There was a problem accessing a property or method of the OLE [email protected] one or more of the following: * Verify that the OLE server is registered correctly by reinstalling it.* Make sure your computer is connected to the server on which the OLE server ap
598. There was a problem communicating with the OLE server Error 2730 There was a problem communicating with the OLE [email protected] again later. If you still can't access the object, try one or more of the following: * Free up system memory. For information on freeing memory, search the Microsoft Windows Help index for 'memory
599. There was a problem communicating with the Source Code Control Add-in Error 7994 There was a problem communicating with the Source Code Control [email protected]@@[email protected]@@3.
600. There was a problem loading the | object Error 2697 There was a problem loading the | [email protected] object you tried to create or edit is not a valid OLE [email protected] the object, and then embed or link it [email protected]@[email protected]@1.
601. There was a problem reading this document (109) Error 109 There was a problem reading this document (109). A Corrupt or Unreadable PDF File. Chances are, if you are seeing error 109 when opening a PDF file, the file is corrupt.
602. There was a problem referencing a property or method of an object Error 2761 There was a problem referencing a property or method of an [email protected] the component's documentation for information on the properties and methods it makes available for Automation [email protected]@[email protected]@@1.
603. There was a problem referencing a property or method of the object Error 2755 There was a problem referencing a property or method of the [email protected] tried to run a Visual Basic procedure that references an object property or [email protected] one or more of the following: * Make sure the component is properly registered.* Make sure your
604. There was a problem retrieving information from the printer Error 2214 There was a problem retrieving information from the printer. New printer has not been [email protected]@@[email protected]@@1.
605. There was a problem retrieving printer information for the |1 on |2 Error 2201 There was a problem retrieving printer information for the |1 on |2. The object may have been sent to a printer that is [email protected]@@@@@.
606. There was a problem retrieving printer information for this object Error 2213 There was a problem retrieving printer information for this object. The object may have been sent to a printer that is [email protected]@@[email protected]@@1.
607. There was a problem with the digital certificate Error 29076 There was a problem with the digital certificate. The VBA project could not be signed. The signature will be [email protected]@@[email protected]@@1.
608. There was an error compiling this function Error 7960 There was an error compiling this [email protected] Visual Basic module contains a syntax [email protected] the code, and then recompile [email protected]@@@1.
609. There was an error creating your |1 Error 7791 There was an error creating your |[email protected] fields may have been skipped because there was an error getting information about them or because they didn't fit on the |[email protected]@[email protected]@@1.
610. There was an error displaying the mail message Error 32548 There was an error displaying the mail message. Make sure that there are no open dialogs in Outlook and try again.
611. There was an error displaying the task Error 32551 There was an error displaying the task. Make sure that there are no open dialogs in Outlook and try again.
612. There was an error downloading your purchased music Error -50 There was an error downloading your purchased music. An unknown error occurred (-50).
613. There was an error in loading your file Error 25930 There was an error in loading your file. Access to file denied. Make sure you have read access to the selected file.
614. There was an error in the application Error 6111 There was an error in the application. This error is related to Adobe Flash (SWF) files being blocked by a content filter, firewall, or proxy.
615. There was an error loading an ActiveX control on one of your forms or reports Error 2805 There was an error loading an ActiveX control on one of your forms or [email protected] sure all the controls that you are using are properly registered. For information on registering an ActiveX control, click [email protected]@[email protected]@[email protected]
616. There was an error loading the XML data file '|1' Error 31540 There was an error loading the XML data file '|1'. Please make sure that the file is a properly formatted XML file. |2.
617. There was an error loading the XSL transformation file '|1' Error 31539 There was an error loading the XSL transformation file '|1'. Please make sure that the file is a properly formatted XSL file and is the correct file to use for the data supplied. |2.
618. There was an error publishing your database Error 32604 There was an error publishing your database. Verify your publish URL and permissions, and then try again.
619. There were compilation errors during the conversion or enabling of this database Error 29022 There were compilation errors during the conversion or enabling of this [email protected] database has not been saved in a compiled state. The performance of this database will be impaired because Microsoft Office Access will need to recompile the database fo
620. There were compilation errors during the conversion or enabling of this database Error 29061 There were compilation errors during the conversion or enabling of this [email protected] might be due to old DAO syntax that is no longer supported.For an example on how to fixup the code, click Help. @@[email protected]@[email protected]
621. There were errors during the database transfer operation Error 7838 There were errors during the database transfer operation. Open the transfer log file for [email protected]@@[email protected]@@1.
622. There were too many message recipients; the message was not sent Error 2290 There were too many message recipients; the message was not [email protected]@@[email protected]@@1.
623. There's not enough disk space Error 2627 There's not enough disk [email protected]@@[email protected]@@1.
624. This action can't be carried out while processing a form or report event Error 2585 This action can't be carried out while processing a form or report [email protected] macro specified as the OnOpen, OnLoad, OnClose, OnFormat, OnRetreat, OnPage, or OnPrint property setting contains an invalid action for the [email protected] you click OK, an Action
625. This action is only valid for products that are currently installed Error 1605 This action is only valid for products that are currently installed. Error occurs during uninstaling AVG from the Control Panel.
626. This action requires an Object Name argument Error 2493 This action requires an Object Name [email protected]@@[email protected]@@1.
627. This action will reset the current code in break mode Error 29013 This action will reset the current code in break [email protected] you want to stop the running [email protected]* To halt the execution of the program so the Module window can be closed, select Yes.* To leave the code in the current state, select [email protected]@@@1.
628. This ActiveX control isn't enabled in Form view Error 7758 This ActiveX control isn't enabled in Form [email protected] can't set the Enabled or TabStop properties to [email protected]@[email protected]@@1.
629. This ActiveX control isn't visible in Form view Error 7759 This ActiveX control isn't visible in Form [email protected] can't set the Visible or TabStop properties to [email protected]@[email protected]@@1.
630. This application has failed to start because the application configuration is incorrect Error Side-By-Side Configuration This application has failed to start because the application configuration is incorrect. This error is only referring to the user interface. The AVG Free Antivirus is working fine, but the user cannot view the user interface or access scan reports.
631. This array is fixed or temporarily locked Error 10 Not all arrays can be redimensioned. Even arrays specifically declared to be dynamic and arrays within Variant variables are sometimes locked temporarily.
632. This command is not available when the database is opened from the Web server Error 32552 This command is not available when the database is opened from the Web server. Would you like to save a local copy of the database?.
633. This component doesn't support this set of events Error 459 Not every component supports client sinking of events.
634. This connection file refers to a provider not supported by data access pages Error 2910 This connection file refers to a provider not supported by data access [email protected] select a different connection [email protected]@@@@1.
635. This control can't be changed to the type you requested Error 7766 This control can't be changed to the type you [email protected]@@[email protected]@@1.
636. This control is read-only and can't be modified Error 2222 This control is read-only and can't be [email protected]@@[email protected]@@1.
637. This database contains links to lists on the selected SharePoint site Error 32597 This database contains links to lists on the selected SharePoint site.Do you want to be able to add shortcuts to each list's View menu? This will enable other people to open forms and reports from the SharePoint Web page.
638. This database does not have a Visual Basic project, so it can't be made into an MDE file Error 7806 This database does not have a Visual Basic project, so it can't be made into an MDE [email protected] the database in Microsoft Office Access to create the Visual Basic [email protected]@[email protected]@@1.
639. This Database has been upgraded to the Access 2007 File Format Error 9549 This Database has been upgraded to the Access 2007 File Format. The new database cannot be shared with users of Access 2003 or earlier [email protected] more information about conversion, click [email protected]@[email protected]@[email protected]
640. This database is a replica created in a different version of Access Error 2573 This database is a replica created in a different version of Access. @You can only convert this replica by synchronizing with its Design Master. @Convert the Design Master of this replica set then synchronize the replica with the Design [email protected]@@@1.
641. This database is enabled for publication Error 8091 This database is enabled for [email protected] you want to delete existing publications and drop the [email protected]@[email protected]@@2.
642. This database is in an unexpected state and Microsoft Office Access cannot open it Error 2572 This database is in an unexpected state and Microsoft Office Access cannot open [email protected] database has been converted from a prior version of Microsoft Office Access by using the DAO CompactDatabase method instead of the Convert Database command (click the
643. This database is in an unrecognized format Error 7801 This database is in an unrecognized [email protected] database may have been created with a later version of Microsoft Office Access than the one you are using. Upgrade your version of Microsoft Office Access to the current one, then open this [email protected]@[email protected]@@1.
644. This database must be closed before you can create a replica Error 9542 This database must be closed before you can create a [email protected] you want Microsoft Office Access to close this database and create the replica?If you proceed, Microsoft Office Access will close your database and convert it to a Design Master. The databas
645. This database object cannot be saved as a report Error 32586 This database object cannot be saved as a [email protected]@@[email protected]@@1.
646. This database was created using a previous version of Microsoft Office Access Error 8405 This database was created using a previous version of Microsoft Office [email protected] You can share the database with users of previous versions of Microsoft Office Access, however some enhancements will be unavailable.- You can open the database, view objects
647. This database was saved in the Microsoft Access | file format Error 31595 This database was saved in the Microsoft Access | file [email protected] information on how to import data from this database into a new file, click Microsoft Office Online on the Getting Started with Microsoft Office Access [email protected]@[email protected]@@1.
648. This disk is write-protected Error 2735 This disk is write-protected. You can't save the | object to [email protected]@@[email protected]@@1.
649. This document could not be saved Error 14 "This document could not be saved. There was a problem reading this document (14). In some cases due to a corrupt data file you may receive an error message stating ""This document could not be saved. There was a problem reading this document (14)."" when
650. This document was previously formatted for the printer '|1 on |2', but that printer isn't available Error 10701 This document was previously formatted for the printer '|1 on |2', but that printer isn't available. The page settings shown in the Print Setup dialog box are for the current default printer '|3'[email protected] you want to [email protected]@[email protected]@@1.
651. This document was previously formatted for the printer |1 on |2, but that printer isn't available Error 10700 This document was previously formatted for the printer |1 on |2, but that printer isn't available. Do you want to use the default printer |[email protected]@@[email protected]@@1.
652. This does not appear to be a template file Error 32564 This does not appear to be a template file. The file may have become corrupt, or the package format may contain an error.
653. This error indicates that the file you are trying to convert contains a DRM encryption for copyright protection Error 27 This error indicates that the file you are trying to convert contains a DRM encryption for copyright protection. DivX Plus Converter cannot convert any files containing DRM encryption.
654. This expression is typed incorrectly, or it is too complex to be evaluated Error 3071 This expression is typed incorrectly, or it is too complex to be evaluated. For example, a numeric expression may contain too many complicated elements. Try simplifying the expression by assigning parts of the expression to variables.
655. This feature is not available in an MDB or ACCDB Error 2593 This feature is not available in an MDB or [email protected]@@[email protected]@@1.
656. This feature is only available in an ADP Error 32585 This feature is only available in an [email protected]@@[email protected]@@1.
657. This feature isn't installed, or has been disabled Error 7763 This feature isn't installed, or has been [email protected] install this feature, rerun the Microsoft Office Access or the Microsoft Office Setup program or, if you're using a third-party add-in, reinstall the add-in. To reenable this wizard, click the Microso
658. This field will be converted to Plain Text and all the formatting in the field will be removed Error 10032 This field will be converted to Plain Text and all the formatting in the field will be [email protected] you want to convert the column to Plain [email protected]@[email protected]@@2.
659. This field will be converted to Rich Text, and all the data it contains will be HTML encoded Error 10033 This field will be converted to Rich Text, and all the data it contains will be HTML [email protected] your data already contains valid HTML Rich Text, you can remove any extra HTML encoding by using the PlainText function in an update query. Do you want to con
660. This file was created in a previous beta version of Excel 2007 Error 3850 This file was created in a previous beta version of Excel 2007. Open the file with Excel 2007 to save it to the most recent version of the Excel 2007 file format before opening the file in Access 2007.
661. This form or report is based on a query that exceeds the limit for data in a single record Error 7799 This form or report is based on a query that exceeds the limit for data in a single [email protected] any unnecessary fields from the query, or change some of the field types to Memo in the original [email protected]@[email protected]@@1.
662. This format does not support objects named '|' Error 6020 This format does not support objects named '|'. Rename the object and try [email protected]@@[email protected]@@1.
663. This installation package could not be opened Error 1619 This installation package could not be opened. Verify that the package exists and that you can access it, or contact the application vendor to verify that this is a valid Windows Installer package.
664. This is a non-critical error Error 0x80073B01 This is a non-critical error. Your PC is still protected.
665. This is already an MDE database Error 7805 This is already an MDE [email protected]@@[email protected]@@1.
666. This key is already associated with an element of this collection Error 457 A key is a string specified in the Add method that uniquely identifies a specific member of a collection.
667. This linked table has indexes that use an unsupported sort order Error 8064 This linked table has indexes that use an unsupported sort [email protected] you modify this table, the Microsoft Office Access database engine can't correctly maintain the table's indexes. As a result, your data may appear in the wrong order, and functions that
668. This member of the replica set has conflicts from synchronizing changes with other members Error 7705 This member of the replica set has conflicts from synchronizing changes with other [email protected] you want to resolve these conflicts [email protected]@[email protected]@@2.
669. This member of the replica set is now the Design Master Error 7711 This member of the replica set is now the Design Master. Microsoft Office Access will now close and reopen the database in order for the changes to take [email protected]@@[email protected]@@1.
670. This method is not supported for Attachment controls in the current database file format Error 31006 This method is not supported for Attachment controls in the current database file [email protected]@@[email protected]@@1.
671. This object is locked Error 2800 This object is locked. Any changes you make will be discarded when the form is [email protected] the Microsoft Office Button, point to Save As, and save the object under a different [email protected]@[email protected]@@1.
672. This object was saved in an invalid format and cannot be read Error 6037 This object was saved in an invalid format and cannot be [email protected]@@[email protected]@@1.
673. This object will be removed from your local database, but not from source code control Error 8078 This object will be removed from your local database, but not from source code [email protected] next time you get this database from source code control, the object will reappear. Are you sure that you want to delete the local [email protected]@[email protected]@@2.
674. This OLE object was created in an earlier version of OLE so it can't be displayed as an icon Error 2797 This OLE object was created in an earlier version of OLE so it can't be displayed as an [email protected] an effect similar to displaying an object as an icon, add an image control to your form, and add the icon for the application to the image control. Then set
675. This operation is not supported for parameterized queries or objects based on parameterized queries Error 32529 This operation is not supported for parameterized queries or objects based on parameterized [email protected]@@[email protected]@@1.
676. This operation is not supported for SharePoint linked tables Error 31672 This operation is not supported for SharePoint linked tables. To manage SharePoint linked tables, point to Get External Data on the Data menu, and then click SharePoint List.
677. This operation is not supported within transactions Error 2074 This operation is not supported within [email protected]@@[email protected]@@1.
678. This operation isn't available while there is a module in break mode Error 29021 This operation isn't available while there is a module in break [email protected] the executing code and try the operation [email protected]@[email protected]@@1.
679. This operation requires an open database Error 2075 This operation requires an open [email protected]@@[email protected]@@1.
680. This operation requires at least Microsoft SQL Server 2000 to be installed on your local computer Error 7842 This operation requires at least Microsoft SQL Server 2000 to be installed on your local [email protected]@@[email protected]@@1.
681. This page uses a database which is not supported Error 2885 This page uses a database which is not supported. You will not be able to make data changes until you connect to a supported database.
682. This platform is not supported by this installation package Error 0xE001D027 This platform is not supported by this installation package. Please ensure that you have been downloading the correct package.
683. This product has has encountered a problem which requires that you restart your computer before it can be launched Error 130:3 This product has has encountered a problem which requires that you restart your computer before it can be launched. Error 130: 3 indicates that your Adobe software is unable to verify that you are running a correctly licensed version of the software.
684. This property has been replaced by a new property; use the new property instead Error 2190 This property has been replaced by a new property; use the new property [email protected]@@[email protected]@@1.
685. This property is available only in Design view Error 2187 This property is available only in Design [email protected]@@[email protected]@@1.
686. This property is locked and can't be changed Error 7760 This property is locked and can't be [email protected]@@[email protected]@@1.
687. This property is only available for attachment controls bound to attachment fields Error 6034 This property is only available for attachment controls bound to attachment [email protected]@@[email protected]@@1.
688. This property is read-only and can't be modified Error 2167 This property is read-only and can't be [email protected]@@[email protected]@@1.
689. This property is read-only and can't be set Error 2135 This property is read-only and can't be [email protected]@@[email protected]@@1.
690. This property isn't available in Design view Error 2186 This property isn't available in Design [email protected] to Form view to access this property, or remove the reference to the [email protected]@[email protected]@@1.
691. This relationship has already been deleted by another user Error 10604 This relationship has already been deleted by another [email protected] update your view, click [email protected]@[email protected]@@1.
692. This stage of the conversion process is finished Error 7748 This stage of the conversion process is finished. To complete the conversion process, synchronize this replica to the (converted) Design Master.
693. This table contains one or more Lookup fields Error 8549 This table contains one or more Lookup fields. Display values for Lookup fields cannot be changed by using the Replace [email protected]@@[email protected]@[email protected]
694. This table is read-only Error 2378 This table is [email protected] a different name in the Save As dialog box to save your [email protected]@[email protected]@@1.
695. This table or query can't be opened because it has no visible fields Error 2316 This table or query can't be opened because it has no visible [email protected] can result if the table or query has only system fields, and the Show System Objects option is [email protected] turn on the Show System Objects option, click Options on the Tools menu, clic
696. This template cannot be used because it requires a later version of Microsoft Office Access Error 31637 This template cannot be used because it requires a later version of Microsoft Office Access. See Microsoft Office Online for the latest templates you can use with your current version of Microsoft Office Access.
697. This template requires a SharePoint site with a newer version of Windows SharePoint services Error 32574 This template requires a SharePoint site with a newer version of Windows SharePoint services. Specify a different site.
698. This type of control can't contain other controls Error 2150 This type of control can't contain other [email protected]@@[email protected]@@1.
699. This value must be a number Error 2262 This value must be a [email protected]@@[email protected]@@1.
700. This web page contains XML namespaces that may conflict with Access namespaces Error 2881 This web page contains XML namespaces that may conflict with Access namespaces. You should edit the HTML source to ensure that all namespaces have a unique prefix.
701. This will clear all the contents in your MSysNavPaneXXX system tables Error 31620 This will clear all the contents in your MSysNavPaneXXX system [email protected] you want to [email protected]@[email protected]@@1.
702. Thunderbird Error 1460 Error 1460 Error 1460: Mozilla Thunderbird has encountered a problem and needs to close. We are sorry for the inconvenience.
703. Thunderbird Error 5.7.1 Error 5.7.1 Error 5.7.1: Mozilla Thunderbird has encountered a problem and needs to close. We are sorry for the inconvenience.
704. Thunderbird Error Code 10060 Error 10060 Error 10060: Mozilla Thunderbird has encountered a problem and needs to close. We are sorry for the inconvenience.
705. Thunderbird Error Code 12263 Error 12263 Error 12263: Mozilla Thunderbird has encountered a problem and needs to close. We are sorry for the inconvenience.
706. TIMEOUT Error 0x800CCC19 Error 0x800CCC19: Microsoft Outlook has encountered a problem and needs to close. We are sorry for the inconvenience.
707. Timeout error Error 100  Error 100 : Comodo Cloud Drive has encountered a problem and needs to close. We are sorry for the inconvenience.
708. Timeout while waiting for DDE response Error 286 The other application in a DDE conversation did not respond within the time specified by the LinkTimeout property.
709. TLV violation Error 3716 TLV violation. This record contains a field value that does not meet the table level validation constraint. Either update the field value that is violating the validation rule and then resubmit this conflict record, or delete this conflict record.
710. To create a relationship, use the mouse to drag a field from one table to another Error 10608 To create a relationship, use the mouse to drag a field from one table to [email protected]@@[email protected]@@1.
711. To generate object dependencies, the Track name AutoCorrect info option must be turned on Error 31564 To generate object dependencies, the Track name AutoCorrect info option must be turned [email protected] name AutoCorrect and [email protected]@[email protected]@[email protected]
712. To set this property, open the form or report in Design view Error 2136 To set this property, open the form or report in Design [email protected] more information on this property, search the Help index for the name of the [email protected]@[email protected]@@1.
713. To view dependency information, you must select a table, query, form, or report Error 31569 To view dependency information, you must select a table, query, form, or [email protected]@@[email protected]@[email protected]
714. Too few parameters Error 3061 Too few parameters. Expected |.
715. Too many CCloud user sessions Error 235 Error 235: Comodo Cloud Drive has encountered a problem and needs to close. We are sorry for the inconvenience.
716. Too many DLL application clients Error 47 The dynamic-link library (DLL) for Visual Basic can only accommodate access by 50 host applications at a time.
717. Too many files Error 67 There is a limit to the number of disk files that can be open at one time.
718. Top-level or invalid menu specified as PopupMenu default Error 490 You specified a default item in the PopupMenu method but that item was not a valid menu item.
719. Tor 404 Error Error 404 Error 404: Tor has encountered a problem and needs to close. We are sorry for the inconvenience.
720. Tor 503 Error Error 503 Error 503: Tor has encountered a problem and needs to close. We are sorry for the inconvenience.
721. Tor Browser Error 126 Error 126 Error 126: Tor has encountered a problem and needs to close. We are sorry for the inconvenience.
722. Tor Browser Error 403 Error 403 Error 403: Tor has encountered a problem and needs to close. We are sorry for the inconvenience.
723. Tor Error 1003 Error 1003 Error 1003: Tor has encountered a problem and needs to close. We are sorry for the inconvenience.
724. Tor Error 10055 Error 10055 Error 10055: Tor has encountered a problem and needs to close. We are sorry for the inconvenience.
725. Tor Error 127 Error 127 Error 127: Tor has encountered a problem and needs to close. We are sorry for the inconvenience.
726. Tor Error 2005 Error 2005 Error 2005: Tor has encountered a problem and needs to close. We are sorry for the inconvenience.
727. Tor Error 208 Error 208 Error 208: Tor has encountered a problem and needs to close. We are sorry for the inconvenience.
728. Tor Error 4001 Error 4001 Error 4001: Tor has encountered a problem and needs to close. We are sorry for the inconvenience.
729. Tor Error 407 Error 407 Error 407: Tor has encountered a problem and needs to close. We are sorry for the inconvenience.
730. Tor Error 500 Error 500 Error 500: Tor has encountered a problem and needs to close. We are sorry for the inconvenience.
731. Tor Error 502 Error 502 Error 502: Tor has encountered a problem and needs to close. We are sorry for the inconvenience.
732. Tor Error 504 Error 504 Error 504: Tor has encountered a problem and needs to close. We are sorry for the inconvenience.
733. Tor Error 514 Authentication Required Error 514 Error 514: Tor has encountered a problem and needs to close. We are sorry for the inconvenience.
734. Tor Error 6 Error 6 Error 6: Tor has encountered a problem and needs to close. We are sorry for the inconvenience.
735. Tor Error 9000 Error 9000 Error 9000: Tor has encountered a problem and needs to close. We are sorry for the inconvenience.
736. Tor Error At Line 1 Error Line 1 Error Line 1: Tor has encountered a problem and needs to close. We are sorry for the inconvenience.
737. Tor Error At Line 3 Error Line3 Error Line3: Tor has encountered a problem and needs to close. We are sorry for the inconvenience.
738. Tor Error Code 16 Error 16 Error 16: Tor has encountered a problem and needs to close. We are sorry for the inconvenience.
739. Tor Error Code C7 Error C7 Error C7: Tor has encountered a problem and needs to close. We are sorry for the inconvenience.
740. Tor Error Line 3 Error Line 3 Error Line 3: Tor has encountered a problem and needs to close. We are sorry for the inconvenience.
741. Tor Network Error 310 Error 310 Error 310: Tor has encountered a problem and needs to close. We are sorry for the inconvenience.
742. Tor Upstream Proxy Error(4) Host Unreachable Error 4 Error 4: Tor has encountered a problem and needs to close. We are sorry for the inconvenience.
743. Torch Browser Error 102 Error 102 This webpage is not available.
744. Torch Browser Error 15 Error 15 (net: : ERR_SOCKET_NOT_CONNECTED): Unknown Error.
745. Total Commander Error 10054 Error 10054 Socket Error 10054.
746. Total Commander Error 2 Error 2 Cannot connect to server.
747. Total Commander Error 29 Error 29 Error executing program.
748. Total Commander Error 3 Error 3 FTP plugin connection problem.
749. Total Commander Error 31 Error 31 Error executing program!.
750. Total Commander Error 5 Error 5 Error 5: Total Commander has encountered a problem and needs to close. We are sorry for the inconvenience.
751. Total Commander Error 500 Error 500 HTTP Error 500: Internal Server Error.
752. Total Commander Error 550 Error 550 FTP 550 error when trying to copy file.
753. Total Commander Error 553 Error 553 553 Could not create file.
754. Total Commander Error Executing Program (5) Error -5 Error -5: Total Commander has encountered a problem and needs to close. We are sorry for the inconvenience.
755. Total Commander Error Executing Program 29 Error 29 Error 29: Total Commander has encountered a problem and needs to close. We are sorry for the inconvenience.
756. Total Commander Error Executing Program 31 Error 31 Error 31: Total Commander has encountered a problem and needs to close. We are sorry for the inconvenience.
757. Train Simulator 2012 Error Line 113 Error Line 113 Error Line 113: Train Simulator has encountered a problem and needs to close. We are sorry for the inconvenience.
758. Trend Micro Error 1935 Error 1935 Error 1935: Trend Micro MaximumSecurity has encountered a problem and needs to close. We are sorry for the inconvenience.
759. Trend Micro Error 20559 Error 20559 Error 20559: Trend Micro MaximumSecurity has encountered a problem and needs to close. We are sorry for the inconvenience.
760. Trend Micro Error 302 Error 302 Error 302: Trend Micro MaximumSecurity has encountered a problem and needs to close. We are sorry for the inconvenience.
761. Trend Micro Error Code 1603 Error 1603 Error 1603: Trend Micro MaximumSecurity has encountered a problem and needs to close. We are sorry for the inconvenience.
762. Trend Micro Error Code 1618 Error 1618 Error 1618: Trend Micro MaximumSecurity has encountered a problem and needs to close. We are sorry for the inconvenience.
763. Trend Micro Error Code 215 Error 215 Error 215: Trend Micro MaximumSecurity has encountered a problem and needs to close. We are sorry for the inconvenience.
764. Trend Micro Error Code 221 Error 221 Error 221: Trend Micro MaximumSecurity has encountered a problem and needs to close. We are sorry for the inconvenience.
765. Trend Micro Error Code 331 Error 331 Error 331: Trend Micro MaximumSecurity has encountered a problem and needs to close. We are sorry for the inconvenience.
766. Turbo Tax Form 6252 Error Error Form 6252 Error Form 6252: TurboTax has encountered a problem and needs to close. We are sorry for the inconvenience.
767. Turbo Tax Form 8824 Error Error Form 8824 Error Form 8824: TurboTax has encountered a problem and needs to close. We are sorry for the inconvenience.
768. Turbo Tax Form 8888 Error Error Form 8888 Error Form 8888: TurboTax has encountered a problem and needs to close. We are sorry for the inconvenience.
769. Turbotax 2008 Error 65535 Error 65535 Error 65535: TurboTax has encountered a problem and needs to close. We are sorry for the inconvenience.
770. Turbotax 2011 Error 7284 Error 7284 Error 7284: TurboTax has encountered a problem and needs to close. We are sorry for the inconvenience.
771. Turbotax 2012 Error 42002 Error 42002 Error 42002: TurboTax has encountered a problem and needs to close. We are sorry for the inconvenience.
772. Turbotax 2012 Error Code 5639 Error 5639 Error 5639: TurboTax has encountered a problem and needs to close. We are sorry for the inconvenience.
773. Turbotax 2013 Error Code 1603 Error 1603 Error 1603: TurboTax has encountered a problem and needs to close. We are sorry for the inconvenience.
774. Turbotax 529 Error Error 529 Error 529: TurboTax has encountered a problem and needs to close. We are sorry for the inconvenience.
775. Turbotax 5405 Error Error 5405 Error 5405: TurboTax has encountered a problem and needs to close. We are sorry for the inconvenience.
776. Turbotax 8829 Error Error 8829 Error 8829: TurboTax has encountered a problem and needs to close. We are sorry for the inconvenience.
777. Turbotax 8863 Error Error 8863 Error 8863: TurboTax has encountered a problem and needs to close. We are sorry for the inconvenience.
778. Turbotax 8889 Error Error 8889 Error 8889: TurboTax has encountered a problem and needs to close. We are sorry for the inconvenience.
779. Turbotax 8949 Error Error 8949 Error 8949: TurboTax has encountered a problem and needs to close. We are sorry for the inconvenience.
780. Turbotax Error 0019 Error 19 Error 19: TurboTax has encountered a problem and needs to close. We are sorry for the inconvenience.
781. Turbotax Error 0510 Error 510 Error 510: TurboTax has encountered a problem and needs to close. We are sorry for the inconvenience.
782. Turbotax Error 0511 Error 511 Error 511: TurboTax has encountered a problem and needs to close. We are sorry for the inconvenience.
783. TurboTax Error 113 Error 113 Installing turbo tax 2010 file i/o error 113.
784. Turbotax Error 1334 Error 1334 Error 1334: TurboTax has encountered a problem and needs to close. We are sorry for the inconvenience.
785. TurboTax Error 14501 Error 14501 GetTax1099 Failed With Error Code = 14501.
786. TurboTax Error 146 Error 146 Error 146: Error saving or loading file.
787. TurboTax Error 1601 Error 1601 Error 1601 Windows installer is not accessible.
788. TurboTax Error 1603 Error 1603 Windows Installer error 1603.
789. TurboTax Error 19 Error 19 Tax Return Rejections-Error Code, Mistake to Correct Online.
790. TurboTax Error 1921 Error 1921 Updating error code 1921.
791. Turbotax Error 1935 Error 1935 Error 1935: TurboTax has encountered a problem and needs to close. We are sorry for the inconvenience.
792. TurboTax Error 2 Error 2 Error Code 2 can occur in several different areas of TurboTax, such as when you are attempting to connect to the Internet to update, import financial information, or transmit a return when filing or downloading.
793. Turbotax Error 2012 Error 2012 Error 2012: TurboTax has encountered a problem and needs to close. We are sorry for the inconvenience.
794. Turbotax Error 2013 Error 2013 Error 2013: TurboTax has encountered a problem and needs to close. We are sorry for the inconvenience.
795. TurboTax Error 209 Error 209 Error 209 displayed when launching or running TurboTax.
796. Turbotax Error 214 Error 214 Error 214: TurboTax has encountered a problem and needs to close. We are sorry for the inconvenience.
797. TurboTax Error 2203 Error 2203 Microsoft Installer Error 2203.
798. TurboTax Error 2502 Error 2502 2502 is a MS installing error.
799. Turbotax Error 25300 Error 25300 Error 25300: TurboTax has encountered a problem and needs to close. We are sorry for the inconvenience.
800. Turbotax Error 25930 Error 25930 Error 25930: TurboTax has encountered a problem and needs to close. We are sorry for the inconvenience.
801. Turbotax Error 26013 Error 26013 Error 26013: TurboTax has encountered a problem and needs to close. We are sorry for the inconvenience.
802. TurboTax Error 36 Error 36 Turbotax install error code -36.
803. Turbotax Error 4 Error 4 Error 4: TurboTax has encountered a problem and needs to close. We are sorry for the inconvenience.
804. TurboTax Error 42001 Error 42001 The name resolver service could not resolve the host name occurs when attempting to update TurboTax.
805. TurboTax Error 42006 Error 42006 Unexpected Error.
806. TurboTax Error 42014 Error 42014 Error 42014: No response was received during the time-out period for a request.
807. TurboTax Error 42015 Error 42015 Error 42015: Could not connect to the update site.
808. TurboTax Error 42016 Error 42016 Error 42016: unexpected content received.
809. TurboTax Error 503 Error 503 ITIN number IRS Rejection code 0503.
810. TurboTax Error 511 Error 511 Return rejected.
811. Turbotax Error 512 Error 512 Error 512: TurboTax has encountered a problem and needs to close. We are sorry for the inconvenience.
812. TurboTax Error 539 Error 539 Error 539 when opening or saving a tax return.
813. TurboTax Error 5405 Error 5405 Error Form 5405: Date Vacated must be in Current Year.
814. TurboTax Error 543 Error 543 Error 543 occurs when attempting to save a tax return data file, usually because the location you want to save to is not available, for example a network or a removable drive.
815. TurboTax Error 5639 Error 5639 Error 5639: Can't configure product update system.
816. TurboTax Error 5640 Error 5640 Error 5640: Can't Configure Product Update System.
817. TurboTax Error 5641 Error 5641 While attempting to install and update TurboTax, or when trying to download a state program, you may get an Error 5641 message.
818. Turbotax Error 6 Error 6 Error 6: TurboTax has encountered a problem and needs to close. We are sorry for the inconvenience.
819. Turbotax Error 601 Error 601 Error 601: TurboTax has encountered a problem and needs to close. We are sorry for the inconvenience.
820. TurboTax Error 604 Error 604 A corrupted tax return file.
821. TurboTax Error 65535 Error 65535 "Error Code 65535: ""Unexpected error""."
822. Turbotax Error 70001 Error 70001 Error 70001: TurboTax has encountered a problem and needs to close. We are sorry for the inconvenience.
823. TurboTax Error 7284 Error 7284 This error appears due to corrupt or missing fonts on your system.
824. TurboTax Error 906 Error 906 Installation Limit Exceeded.
825. Turbotax Error Code 10 Error 10 Error 10: TurboTax has encountered a problem and needs to close. We are sorry for the inconvenience.
826. Turbotax Error Code 1305 Error 1305 Error 1305: TurboTax has encountered a problem and needs to close. We are sorry for the inconvenience.
827. Turbotax Error Code 1327 Error 1327 Error 1327: TurboTax has encountered a problem and needs to close. We are sorry for the inconvenience.
828. Turbotax Error Code 1335 Error 1335 Error 1335: TurboTax has encountered a problem and needs to close. We are sorry for the inconvenience.
829. Turbotax Error Code 1620 Error 1620 Error 1620: TurboTax has encountered a problem and needs to close. We are sorry for the inconvenience.
830. Turbotax Error Code 2318 Error 2318 Error 2318: TurboTax has encountered a problem and needs to close. We are sorry for the inconvenience.
831. Turbotax Error Code 2350 Error 2350 Error 2350: TurboTax has encountered a problem and needs to close. We are sorry for the inconvenience.
832. Turbotax Error Code 2908 Error 2908 Error 2908: TurboTax has encountered a problem and needs to close. We are sorry for the inconvenience.
833. Turbotax Error Code Ind 031 Error IND 31 Error IND 31: TurboTax has encountered a problem and needs to close. We are sorry for the inconvenience.
834. Turbotax Error Code Ind 032 Error IND 32 Error IND 32: TurboTax has encountered a problem and needs to close. We are sorry for the inconvenience.
835. Turbotax Form 8829 Error Error Form 8829 Error Form 8829: TurboTax has encountered a problem and needs to close. We are sorry for the inconvenience.
836. Turbotax Form 8889 Error Error Form 8889 Error Form 8889: TurboTax has encountered a problem and needs to close. We are sorry for the inconvenience.
837. Turbotax Form 8891 Error Error Form 8891 Error Form 8891: TurboTax has encountered a problem and needs to close. We are sorry for the inconvenience.
838. Type mismatch Error 7789 Type [email protected]@@[email protected]@@1.
839. Type mismatch Error 13 Visual Basic is able to convert and coerce many values to accomplish data type assignments that weren't possible in earlier versions.
840. TypeError: Error #1009: Cannot access a property or method of a null object reference Error 1009 TypeError: Error #1009: Cannot access a property or method of a null object reference. at town_fla: : Button_237/frame1().
Home     Blog     About     Privacy Policy     Contact Us


Microsoft & Windows® logos are registered trademarks of Microsoft. Disclaimer: ErrorVault.com is not affiliated with Microsoft, nor does it claim such affiliation.
The information on this page is provided for informational purposes only. © Copyright 2018